Report for Win32-MMF-0.09e

Back
From: metabase:user:322078bc-2aae-11df-837a-5e0a49663a4f
Subject: NA Win32-MMF-0.09e v5.13.6 GNU/Linux
Date: 2011-06-13T15:02:38Z

This distribution has been tested as part of the CPAN Testers
project, supporting the Perl programming language.  See
http://wiki.cpantesters.org/ for more information or email
questions to cpan-testers-discuss@perl.org


--

Dear ROGER,

This is a computer-generated error report created automatically by
CPANPLUS, version 0.9105. Testers personal comments may appear
at the end of this report.


Thank you for uploading your work to CPAN.  However, it appears that
there were some problems testing your distribution.

TEST RESULTS:

Below is the error stack from stage 'fetch':

[MSG] [Mon Jun 13 16:01:27 2011] Trying to get 'http://cpan.mirror.local/CPAN/authors/id/R/RO/ROGER/CHECKSUMS'
[MSG] [Mon Jun 13 16:01:27 2011] Checksum matches for 'Win32-MMF-0.09e.zip'
[MSG] [Mon Jun 13 16:01:27 2011] Extracted 'Win32::MMF' to '/home/cpan/pit/bare/conf/perl-5.13.6/.cpanplus/5.13.6/build/Win32-MMF'
[MSG] [Mon Jun 13 16:01:27 2011] CPANPLUS is prefering Build.PL
[MSG] [Mon Jun 13 16:01:27 2011] Loading YACSmoke database "/home/cpan/pit/bare/conf/perl-5.13.6/.cpanplus/cpansmoke.dat"
[MSG] [Mon Jun 13 16:01:27 2011] Checking if your kit is complete...
Looks good
Writing Makefile for Win32::MMF
Writing MYMETA.yml

[MSG] [Mon Jun 13 16:01:27 2011] DEFAULT 'filter_prereqs' HANDLER RETURNING 'sub return value'
[MSG] [Mon Jun 13 16:01:27 2011] Checking for previous PASS result for "Win32-MMF-0.09e"
[ERROR] [Mon Jun 13 16:01:28 2011] MAKE failed: No such file or directory cp MMF/Shareable.pm blib/lib/Win32/MMF/Shareable.pm
cp MMF.pm blib/lib/Win32/MMF.pm
/home/cpan/pit/bare/perl-5.13.6/bin/perl5.13.6 /home/cpan/pit/bare/perl-5.13.6/lib/5.13.6/ExtUtils/xsubpp  -typemap /home/cpan/pit/bare/perl-5.13.6/lib/5.13.6/ExtUtils/typemap  MMF.xs > MMF.xsc && mv MMF.xsc MMF.c
Please specify prototyping behavior for MMF.xs (see perlxs manual)
cc -c   -fno-strict-aliasing -pipe -fstack-protector -I/usr/local/include -D_LARGEFILE_SOURCE -D_FILE_OFFSET_BITS=64 -O2   -DVERSION=\"0.09\" -DXS_VERSION=\"0.09\" -fPIC "-I/home/cpan/pit/bare/perl-5.13.6/lib/5.13.6/x86_64-linux/CORE"   MMF.c
MMF.xs:36:21: error: windows.h: No such file or directory
MMF.xs: In function '__malloc':
MMF.xs:88: warning: return makes integer from pointer without a cast
MMF.xs:100: warning: return makes integer from pointer without a cast
MMF.xs: In function '__free':
MMF.xs:271: warning: comparison between pointer and integer
MMF.xs: In function '__realloc':
MMF.xs:311: warning: return makes integer from pointer without a cast
MMF.xs: In function '__createvar':
MMF.xs:379: warning: comparison between pointer and integer
MMF.xs: In function 'XS_Win32__MMF_CreateFile':
MMF.xs:492: error: 'HANDLE' undeclared (first use in this function)
MMF.xs:492: error: (Each undeclared identifier is reported only once
MMF.xs:492: error: for each function it appears in.)
MMF.xs:492: error: expected ';' before 'hFile'
MMF.xs:498: error: 'hFile' undeclared (first use in this function)
MMF.xs:500: error: 'GENERIC_WRITE' undeclared (first use in this function)
MMF.xs:500: error: 'GENERIC_READ' undeclared (first use in this function)
MMF.xs:501: error: 'FILE_SHARE_READ' undeclared (first use in this function)
MMF.xs:501: error: 'FILE_SHARE_WRITE' undeclared (first use in this function)
MMF.xs:503: error: 'CREATE_ALWAYS' undeclared (first use in this function)
MMF.xs:504: error: 'FILE_ATTRIBUTE_TEMPORARY' undeclared (first use in this function)
MMF.xs:507: error: expected ')' before 'INVALID_HANDLE_VALUE'
MMF.xs: In function 'XS_Win32__MMF_OpenFile':
MMF.xs:523: error: 'HANDLE' undeclared (first use in this function)
MMF.xs:523: error: expected ';' before 'hFile'
MMF.xs:524: error: 'OFSTRUCT' undeclared (first use in this function)
MMF.xs:524: error: expected ';' before 'of'
MMF.xs:530: error: 'hFile' undeclared (first use in this function)
MMF.xs:530: error: expected ')' before 'OpenFile'
MMF.xs:530: error: expected ')' before 'HFILE_ERROR'
MMF.xs: In function 'XS_Win32__MMF_CreateFileMapping':
MMF.xs:547: error: 'HANDLE' undeclared (first use in this function)
MMF.xs:547: error: expected ';' before 'hmmFile'
MMF.xs:548: error: expected ';' before 'hFile'
MMF.xs:552: error: 'hFile' undeclared (first use in this function)
MMF.xs:552: error: expected ';' before 'szMapFileHandle'
MMF.xs:562: error: 'hmmFile' undeclared (first use in this function)
MMF.xs:564: error: 'PAGE_READWRITE' undeclared (first use in this function)
MMF.xs: In function 'XS_Win32__MMF_OpenFileMapping':
MMF.xs:582: error: 'HANDLE' undeclared (first use in this function)
MMF.xs:582: error: expected ';' before 'hFile'
MMF.xs:592: error: 'hFile' undeclared (first use in this function)
MMF.xs:592: error: 'FILE_MAP_WRITE' undeclared (first use in this function)
MMF.xs:596: error: expected ')' before 'INVALID_HANDLE_VALUE'
MMF.xs: In function 'XS_Win32__MMF_MapViewOfFile':
MMF.xs:614: error: 'LPVOID' undeclared (first use in this function)
MMF.xs:614: error: expected ';' before 'mem'
MMF.xs:621: error: 'mem' undeclared (first use in this function)
MMF.xs:621: error: 'HANDLE' undeclared (first use in this function)
MMF.xs:621: error: expected ')' before 'szMemoryMapFileHandle'
MMF.xs: In function 'XS_Win32__MMF_UnmapViewOfFile':
MMF.xs:635: error: 'LPVOID' undeclared (first use in this function)
MMF.xs:635: error: expected ';' before 'mem'
MMF.xs:639: error: 'mem' undeclared (first use in this function)
MMF.xs:639: error: expected ';' before 'szView'
MMF.xs: In function 'XS_Win32__MMF_CloseHandle':
MMF.xs:649: error: 'HANDLE' undeclared (first use in this function)
MMF.xs:649: error: expected ')' before 'szHandle'
MMF.xs: In function 'XS_Win32__MMF_CreateSemaphore':
MMF.xs:656: error: 'HANDLE' undeclared (first use in this function)
MMF.xs:656: error: expected ';' before 'hSemaphore'
MMF.xs:664: error: 'hSemaphore' undeclared (first use in this function)
MMF.xs: In function 'XS_Win32__MMF_WaitForSingleObject':
MMF.xs:682: error: 'HANDLE' undeclared (first use in this function)
MMF.xs:682: error: expected ';' before 'h'
MMF.xs:690: error: 'h' undeclared (first use in this function)
MMF.xs:690: error: expected ';' before 'hSemaphore'
MMF.xs:694: error: 'WAIT_OBJECT_0' undeclared (first use in this function)
MMF.xs: In function 'XS_Win32__MMF_ReleaseSemaphore':
MMF.xs:711: error: 'HANDLE' undeclared (first use in this function)
MMF.xs:711: error: expected ')' before 'hSemaphore'
MMF.xs: In function 'XS_Win32__MMF_GetVar':
MMF.xs:822: error: 'LPVOID' undeclared (first use in this function)
MMF.xs:822: error: expected ')' before 'data'
MMF.xs:822: error: too few arguments to function 'Perl_newSVpvn'
make: *** [MMF.o] Error 1



******************************** NOTE ********************************
The comments above are created mechanically, possibly without manual
checking by the sender.  As there are many people performing automatic
tests on each upload to CPAN, it is likely that you will receive
identical messages about the same problem.

If you believe that the message is mistaken, please reply to the first
one with correction and/or additional informations, and do not take
it personally.  We appreciate your patience. :)
**********************************************************************

Additional comments:


This report was machine-generated by CPANPLUS::Dist::YACSmoke 0.62.
Powered by minismokebox version 0.48

------------------------------
ENVIRONMENT AND OTHER CONTEXT
------------------------------

Environment variables:

    AUTOMATED_TESTING = 1
    LANG = en_US
    LC_COLLATE = C
    PATH = /usr/local/bin:/usr/bin:/bin:/usr/games:/usr/lib64/java/bin:/usr/lib64/qt/bin:/usr/share/texmf/bin:.
    PERL5_CPANPLUS_IS_RUNNING = 4512
    PERL5_CPANPLUS_IS_VERSION = 0.9105
    PERL5_MINISMOKEBOX = 0.48
    PERL5_YACSMOKE_BASE = /home/cpan/pit/bare/conf/perl-5.13.6
    PERL_EXTUTILS_AUTOINSTALL = --defaultdeps
    PERL_MM_USE_DEFAULT = 1
    SHELL = /bin/bash
    TERM = screen

Perl special variables (and OS-specific diagnostics, for MSWin32):

    Perl: $^X = /home/cpan/pit/bare/perl-5.13.6/bin/perl5.13.6
    UID:  $<  = 1001
    EUID: $>  = 1001
    GID:  $(  = 100 100
    EGID: $)  = 100 100


-------------------------------


--

Summary of my perl5 (revision 5 version 13 subversion 6) configuration:
   
  Platform:
    osname=linux, osvers=2.6.33.4, archname=x86_64-linux
    uname='linux slack64 2.6.33.4 #3 smp wed may 12 23:13:09 cdt 2010 x86_64 intel(r) xeon(r) cpu e5520 @ 2.27ghz genuineintel gnulinux '
    config_args='-des -Dprefix=/home/cpan/pit/bare/perl-5.13.6 -Dusedevel'
    hint=recommended, useposix=true, d_sigaction=define
    useithreads=undef, usemultiplicity=undef
    useperlio=define, d_sfio=undef, uselargefiles=define, usesocks=undef
    use64bitint=define, use64bitall=define, uselongdouble=undef
    usemymalloc=n, bincompat5005=undef
  Compiler:
    cc='cc', ccflags ='-fno-strict-aliasing -pipe -fstack-protector -I/usr/local/include -D_LARGEFILE_SOURCE -D_FILE_OFFSET_BITS=64',
    optimize='-O2',
    cppflags='-fno-strict-aliasing -pipe -fstack-protector -I/usr/local/include'
    ccversion='', gccversion='4.4.4', gccosandvers=''
    intsize=4, longsize=8, ptrsize=8, doublesize=8, byteorder=12345678
    d_longlong=define, longlongsize=8, d_longdbl=define, longdblsize=16
    ivtype='long', ivsize=8, nvtype='double', nvsize=8, Off_t='off_t', lseeksize=8
    alignbytes=8, prototype=define
  Linker and Libraries:
    ld='cc', ldflags =' -fstack-protector -L/usr/local/lib'
    libpth=/usr/local/lib /lib /usr/lib /lib64 /usr/lib64 /usr/local/lib64
    libs=-lnsl -lgdbm -ldb -ldl -lm -lcrypt -lutil -lc
    perllibs=-lnsl -ldl -lm -lcrypt -lutil -lc
    libc=, so=so, useshrplib=false, libperl=libperl.a
    gnulibc_version='2.11.1'
  Dynamic Linking:
    dlsrc=dl_dlopen.xs, dlext=so, d_dlsymun=undef, ccdlflags='-Wl,-E'
    cccdlflags='-fPIC', lddlflags='-shared -O2 -L/usr/local/lib -fstack-protector'


Characteristics of this binary (from libperl): 
  Compile-time options: PERL_DONT_CREATE_GVSV PERL_MALLOC_WRAP PERL_USE_DEVEL
                        USE_64_BIT_ALL USE_64_BIT_INT USE_LARGE_FILES
                        USE_PERLIO USE_PERL_ATOF
  Built under linux
  Compiled at Feb 18 2011 10:56:47
  %ENV:
    PERL5_CPANPLUS_IS_RUNNING="4512"
    PERL5_CPANPLUS_IS_VERSION="0.9105"
    PERL5_MINISMOKEBOX="0.48"
    PERL5_YACSMOKE_BASE="/home/cpan/pit/bare/conf/perl-5.13.6"
    PERL_EXTUTILS_AUTOINSTALL="--defaultdeps"
    PERL_MM_USE_DEFAULT="1"
  @INC:
    /home/cpan/pit/bare/perl-5.13.6/lib/site_perl/5.13.6/x86_64-linux
    /home/cpan/pit/bare/perl-5.13.6/lib/site_perl/5.13.6
    /home/cpan/pit/bare/perl-5.13.6/lib/5.13.6/x86_64-linux
    /home/cpan/pit/bare/perl-5.13.6/lib/5.13.6
    .