Report for Win32API-Registry-0.32

Back
From: metabase:user:30f4dfbe-2aae-11df-837a-5e0a49663a4f
Subject: UNKNOWN Win32API-Registry-0.32 v5.12.3 Mac OS X
Date: 2011-09-24T05:04:30Z

This distribution has been tested as part of the CPAN Testers
project, supporting the Perl programming language.  See
http://wiki.cpantesters.org/ for more information or email
questions to cpan-testers-discuss@perl.org


--
Dear Ben Marsh,

This is a computer-generated report for Win32API-Registry-0.32
on perl 5.12.3, created by CPAN-Reporter-1.2002.

Thank you for uploading your work to CPAN.  However, attempting to
test your distribution gave an inconclusive result.

This could be because your distribution had an error during the make/build
stage, did not define tests, tests could not be found, because your tests were
interrupted before they finished, or because the results of the tests could not
be parsed.  You may wish to consult the CPAN Testers Wiki:

http://wiki.cpantesters.org/wiki/CPANAuthorNotes

Sections of this report:

    * Tester comments
    * Program output
    * Prerequisites
    * Environment and other context

------------------------------
TESTER COMMENTS
------------------------------

Additional comments from tester:

this report is from an automated smoke testing program
and was not reviewed by a human for accuracy

------------------------------
PROGRAM OUTPUT
------------------------------

Output from '/usr/bin/make -e -e':

cp cRegistry.pc blib/arch/Win32API/Registry/cRegistry.pc
cp Registry.pm blib/lib/Win32API/Registry.pm
/usr/bin/perl5.12 /Users/nigel/perl/lib/perl5/site_perl/ExtUtils/xsubpp  -typemap /System/Library/Perl/5.12/ExtUtils/typemap -typemap typemap  Registry.xs > Registry.xsc && mv Registry.xsc Registry.c
llvm-gcc-4.2 -c   -arch x86_64 -arch i386 -g -pipe -fno-common -DPERL_DARWIN -fno-strict-aliasing -fstack-protector -I/usr/local/include -Os   -DVERSION=\"0.32\" -DXS_VERSION=\"0.32\"  "-I/System/Library/Perl/5.12/darwin-thread-multi-2level/CORE"   Registry.c
Registry.xs:17:21: error: windows.h: No such file or directory
Registry.xs:90: error: expected '=', ',', ';', 'asm' or '__attribute__' before 'uLastRegErr'
Registry.xs:93: error: expected ')' before 'uErr'
Registry.c: In function 'XS_Win32API__Registry__regLastError':
Registry.c:186: error: 'DWORD' undeclared (first use in this function)
Registry.c:186: error: (Each undeclared identifier is reported only once
Registry.c:186: error: for each function it appears in.)
Registry.c:186: error: expected ';' before 'uError'
Registry.c:187: error: 'LONG' undeclared (first use in this function)
Registry.c:187: error: expected ';' before 'RETVAL'
Registry.c:190: error: 'uError' undeclared (first use in this function)
Registry.c:192: error: expected ':' before numeric constant
Registry.xs:114: error: 'uLastRegErr' undeclared (first use in this function)
Registry.xs:116: error: 'RETVAL' undeclared (first use in this function)
Registry.c: In function 'XS_Win32API__Registry_AllowPriv':
Registry.c:221: error: 'BOOL' undeclared (first use in this function)
Registry.c:221: error: expected ';' before 'bEnable'
Registry.xs:126: error: 'HANDLE' undeclared (first use in this function)
Registry.xs:126: error: expected ';' before 'hToken'
Registry.xs:127: error: 'TOKEN_PRIVILEGES' undeclared (first use in this function)
Registry.xs:127: error: expected ';' before 'tokPrivNew'
Registry.c:235: error: 'bEnable' undeclared (first use in this function)
Registry.c:235: error: expected ':' before numeric constant
Registry.xs:129: error: 'tokPrivNew' undeclared (first use in this function)
Registry.xs:131: error: 'SE_PRIVILEGE_ENABLED' undeclared (first use in this function)
Registry.xs:137: error: 'TOKEN_ADJUST_PRIVILEGES' undeclared (first use in this function)
Registry.xs:137: error: 'hToken' undeclared (first use in this function)
Registry.xs:141: error: 'ERROR_SUCCESS' undeclared (first use in this function)
Registry.xs:149: error: 'INVALID_HANDLE_VALUE' undeclared (first use in this function)
Registry.xs:150: error: 'DWORD' undeclared (first use in this function)
Registry.xs:150: error: expected ';' before 'uErr'
Registry.xs:152: error: 'uErr' undeclared (first use in this function)
Registry.xs:154: error: 'uLastRegErr' undeclared (first use in this function)
Registry.c: In function 'XS_Win32API__Registry_AbortSystemShutdownA':
Registry.c:291: error: 'BOOL' undeclared (first use in this function)
Registry.c:291: error: expected ';' before 'RETVAL'
Registry.xs:164: error: 'RETVAL' undeclared (first use in this function)
Registry.xs:166: error: 'uLastRegErr' undeclared (first use in this function)
Registry.c: In function 'XS_Win32API__Registry_AbortSystemShutdownW':
Registry.c:329: error: 'WCHAR' undeclared (first use in this function)
Registry.c:329: error: 'swComputerName' undeclared (first use in this function)
Registry.c:330: error: 'BOOL' undeclared (first use in this function)
Registry.c:330: error: expected ';' before 'RETVAL'
Registry.c:334: error: expected expression before ')' token
Registry.xs:176: error: 'RETVAL' undeclared (first use in this function)
Registry.xs:178: error: 'uLastRegErr' undeclared (first use in this function)
Registry.c: In function 'XS_Win32API__Registry_InitiateSystemShutdownA':
Registry.c:370: error: 'DWORD' undeclared (first use in this function)
Registry.c:370: error: expected ';' before 'uTimeoutSecs'
Registry.c:371: error: 'BOOL' undeclared (first use in this function)
Registry.c:371: error: expected ';' before 'bForce'
Registry.c:372: error: expected ';' before 'bReboot'
Registry.c:373: error: expected ';' before 'RETVAL'
Registry.c:389: error: 'uTimeoutSecs' undeclared (first use in this function)
Registry.c:389: error: expected ':' before numeric constant
Registry.c:392: error: 'bForce' undeclared (first use in this function)
Registry.c:392: error: expected ':' before numeric constant
Registry.c:395: error: 'bReboot' undeclared (first use in this function)
Registry.c:395: error: expected ':' before numeric constant
Registry.xs:192: error: 'RETVAL' undeclared (first use in this function)
Registry.xs:195: error: 'uLastRegErr' undeclared (first use in this function)
Registry.c: In function 'XS_Win32API__Registry_InitiateSystemShutdownW':
Registry.c:428: error: 'WCHAR' undeclared (first use in this function)
Registry.c:428: error: 'swComputer' undeclared (first use in this function)
Registry.c:429: error: 'swMessage' undeclared (first use in this function)
Registry.c:430: error: 'DWORD' undeclared (first use in this function)
Registry.c:430: error: expected ';' before 'uTimeoutSecs'
Registry.c:431: error: 'BOOL' undeclared (first use in this function)
Registry.c:431: error: expected ';' before 'bForce'
Registry.c:432: error: expected ';' before 'bReboot'
Registry.c:433: error: expected ';' before 'RETVAL'
Registry.c:437: error: expected expression before ')' token
Registry.c:444: error: expected expression before ')' token
Registry.c:449: error: 'uTimeoutSecs' undeclared (first use in this function)
Registry.c:449: error: expected ':' before numeric constant
Registry.c:452: error: 'bForce' undeclared (first use in this function)
Registry.c:452: error: expected ':' before numeric constant
Registry.c:455: error: 'bReboot' undeclared (first use in this function)
Registry.c:455: error: expected ':' before numeric constant
Registry.xs:209: error: 'RETVAL' undeclared (first use in this function)
Registry.xs:212: error: 'uLastRegErr' undeclared (first use in this function)
Registry.c: In function 'XS_Win32API__Registry_RegCloseKey':
Registry.c:488: error: 'HKEY' undeclared (first use in this function)
Registry.c:488: error: expected ';' before 'hKey'
Registry.c:491: error: 'hKey' undeclared (first use in this function)
Registry.c:491: error: expected ':' before numeric constant
Registry.c: In function 'XS_Win32API__Registry_RegConnectRegistryA':
Registry.c:521: error: 'HKEY' undeclared (first use in this function)
Registry.c:521: error: expected ';' before 'hRootKey'
Registry.c:522: error: 'ohKey' undeclared (first use in this function)
Registry.c:532: error: 'hRootKey' undeclared (first use in this function)
Registry.c:532: error: expected ':' before numeric constant
Registry.c:538: error: expected expression before ')' token
Registry.c: In function 'XS_Win32API__Registry_RegConnectRegistryW':
Registry.c:572: error: 'WCHAR' undeclared (first use in this function)
Registry.c:572: error: 'swComputer' undeclared (first use in this function)
Registry.c:573: error: 'HKEY' undeclared (first use in this function)
Registry.c:573: error: expected ';' before 'hRootKey'
Registry.c:574: error: 'ohKey' undeclared (first use in this function)
Registry.c:579: error: expected expression before ')' token
Registry.c:584: error: 'hRootKey' undeclared (first use in this function)
Registry.c:584: error: expected ':' before numeric constant
Registry.c:590: error: expected expression before ')' token
Registry.c: In function 'XS_Win32API__Registry_RegCreateKeyA':
Registry.c:623: error: 'HKEY' undeclared (first use in this function)
Registry.c:623: error: expected ';' before 'hKey'
Registry.c:625: error: 'ohSubKey' undeclared (first use in this function)
Registry.c:628: error: 'hKey' undeclared (first use in this function)
Registry.c:628: error: expected ':' before numeric constant
Registry.c:641: error: expected expression before ')' token
Registry.c: In function 'XS_Win32API__Registry_RegCreateKeyW':
Registry.c:674: error: 'HKEY' undeclared (first use in this function)
Registry.c:674: error: expected ';' before 'hKey'
Registry.c:675: error: 'WCHAR' undeclared (first use in this function)
Registry.c:675: error: 'swSubKey' undeclared (first use in this function)
Registry.c:676: error: 'ohSubKey' undeclared (first use in this function)
Registry.c:679: error: 'hKey' undeclared (first use in this function)
Registry.c:679: error: expected ':' before numeric constant
Registry.c:684: error: expected expression before ')' token
Registry.c:692: error: expected expression before ')' token
Registry.c: In function 'XS_Win32API__Registry_RegCreateKeyExA':
Registry.c:725: error: 'HKEY' undeclared (first use in this function)
Registry.c:725: error: expected ';' before 'hKey'
Registry.c:727: error: 'DWORD' undeclared (first use in this function)
Registry.c:727: error: expected ';' before 'uZero'
Registry.c:729: error: expected ';' before 'uOpts'
Registry.c:730: error: 'REGSAM' undeclared (first use in this function)
Registry.c:730: error: expected ';' before 'uAccess'
Registry.c:732: error: 'ohNewKey' undeclared (first use in this function)
Registry.c:733: error: 'ouDisp' undeclared (first use in this function)
Registry.c:736: error: 'hKey' undeclared (first use in this function)
Registry.c:736: error: expected ':' before numeric constant
Registry.c:746: error: 'uZero' undeclared (first use in this function)
Registry.c:746: error: expected ':' before numeric constant
Registry.c:756: error: 'uOpts' undeclared (first use in this function)
Registry.c:756: error: expected ':' before numeric constant
Registry.c:759: error: 'uAccess' undeclared (first use in this function)
Registry.c:759: error: expected ':' before numeric constant
Registry.c:772: error: expected expression before ')' token
Registry.c:779: error: expected expression before ')' token
Registry.xs:290: error: 'SECURITY_ATTRIBUTES' undeclared (first use in this function)
Registry.xs:290: error: expected expression before ')' token
Registry.c: In function 'XS_Win32API__Registry_RegCreateKeyExW':
Registry.c:817: error: 'HKEY' undeclared (first use in this function)
Registry.c:817: error: expected ';' before 'hKey'
Registry.c:818: error: 'WCHAR' undeclared (first use in this function)
Registry.c:818: error: 'swSubKey' undeclared (first use in this function)
Registry.c:819: error: 'DWORD' undeclared (first use in this function)
Registry.c:819: error: expected ';' before 'uZero'
Registry.c:820: error: 'swClass' undeclared (first use in this function)
Registry.c:821: error: expected ';' before 'uOpts'
Registry.c:822: error: 'REGSAM' undeclared (first use in this function)
Registry.c:822: error: expected ';' before 'uAccess'
Registry.c:824: error: 'ohNewKey' undeclared (first use in this function)
Registry.c:825: error: 'ouDisp' undeclared (first use in this function)
Registry.c:828: error: 'hKey' undeclared (first use in this function)
Registry.c:828: error: expected ':' before numeric constant
Registry.c:833: error: expected expression before ')' token
Registry.c:838: error: 'uZero' undeclared (first use in this function)
Registry.c:838: error: expected ':' before numeric constant
Registry.c:843: error: expected expression before ')' token
Registry.c:848: error: 'uOpts' undeclared (first use in this function)
Registry.c:848: error: expected ':' before numeric constant
Registry.c:851: error: 'uAccess' undeclared (first use in this function)
Registry.c:851: error: expected ':' before numeric constant
Registry.c:864: error: expected expression before ')' token
Registry.c:871: error: expected expression before ')' token
Registry.xs:311: error: 'SECURITY_ATTRIBUTES' undeclared (first use in this function)
Registry.xs:311: error: expected expression before ')' token
Registry.c: In function 'XS_Win32API__Registry_RegDeleteKeyA':
Registry.c:909: error: 'HKEY' undeclared (first use in this function)
Registry.c:909: error: expected ';' before 'hKey'
Registry.c:913: error: 'hKey' undeclared (first use in this function)
Registry.c:913: error: expected ':' before numeric constant
Registry.c: In function 'XS_Win32API__Registry_RegDeleteKeyW':
Registry.c:949: error: 'HKEY' undeclared (first use in this function)
Registry.c:949: error: expected ';' before 'hKey'
Registry.c:950: error: 'WCHAR' undeclared (first use in this function)
Registry.c:950: error: 'swSubKey' undeclared (first use in this function)
Registry.c:953: error: 'hKey' undeclared (first use in this function)
Registry.c:953: error: expected ':' before numeric constant
Registry.c:958: error: expected expression before ')' token
Registry.c: In function 'XS_Win32API__Registry_RegDeleteValueA':
Registry.c:989: error: 'HKEY' undeclared (first use in this function)
Registry.c:989: error: expected ';' before 'hKey'
Registry.c:993: error: 'hKey' undeclared (first use in this function)
Registry.c:993: error: expected ':' before numeric constant
Registry.c: In function 'XS_Win32API__Registry_RegDeleteValueW':
Registry.c:1029: error: 'HKEY' undeclared (first use in this function)
Registry.c:1029: error: expected ';' before 'hKey'
Registry.c:1030: error: 'WCHAR' undeclared (first use in this function)
Registry.c:1030: error: 'swValueName' undeclared (first use in this function)
Registry.c:1033: error: 'hKey' undeclared (first use in this function)
Registry.c:1033: error: expected ':' before numeric constant
Registry.c:1038: error: expected expression before ')' token
Registry.c: In function 'XS_Win32API__Registry__RegEnumKeyA':
Registry.c:1068: error: 'HKEY' undeclared (first use in this function)
Registry.c:1068: error: expected ';' before 'hKey'
Registry.c:1069: error: 'DWORD' undeclared (first use in this function)
Registry.c:1069: error: expected ';' before 'uIndex'
Registry.c:1071: error: expected ';' before 'ilNameSize'
Registry.c:1074: error: 'hKey' undeclared (first use in this function)
Registry.c:1074: error: expected ':' before numeric constant
Registry.c:1077: error: 'uIndex' undeclared (first use in this function)
Registry.c:1077: error: expected ':' before numeric constant
Registry.xs:362: error: 'ilNameSize' undeclared (first use in this function)
Registry.c: In function 'XS_Win32API__Registry__RegEnumKeyW':
Registry.c:1109: error: 'HKEY' undeclared (first use in this function)
Registry.c:1109: error: expected ';' before 'hKey'
Registry.c:1110: error: 'DWORD' undeclared (first use in this function)
Registry.c:1110: error: expected ';' before 'uIndex'
Registry.c:1111: error: 'WCHAR' undeclared (first use in this function)
Registry.c:1111: error: 'oswName' undeclared (first use in this function)
Registry.c:1112: error: expected ';' before 'ilwNameSize'
Registry.c:1115: error: 'hKey' undeclared (first use in this function)
Registry.c:1115: error: expected ':' before numeric constant
Registry.c:1118: error: 'uIndex' undeclared (first use in this function)
Registry.c:1118: error: expected ':' before numeric constant
Registry.xs:376: error: expected expression before ')' token
Registry.xs:376: error: 'ilwNameSize' undeclared (first use in this function)
Registry.c: In function 'XS_Win32API__Registry__RegEnumKeyExA':
Registry.c:1150: error: 'HKEY' undeclared (first use in this function)
Registry.c:1150: error: expected ';' before 'hKey'
Registry.c:1151: error: 'DWORD' undeclared (first use in this function)
Registry.c:1151: error: expected ';' before 'uIndex'
Registry.c:1153: error: 'iolName' undeclared (first use in this function)
Registry.c:1154: error: 'pNull' undeclared (first use in this function)
Registry.c:1156: error: 'iolClass' undeclared (first use in this function)
Registry.c:1157: error: 'FILETIME' undeclared (first use in this function)
Registry.c:1157: error: 'opftLastWrite' undeclared (first use in this function)
Registry.xs:394: error: expected ';' before 'uErr'
Registry.c:1163: error: 'hKey' undeclared (first use in this function)
Registry.c:1163: error: expected ':' before numeric constant
Registry.c:1166: error: 'uIndex' undeclared (first use in this function)
Registry.c:1166: error: expected ':' before numeric constant
Registry.c:1172: error: expected expression before ')' token
Registry.c:1175: error: expected expression before ')' token
Registry.xs:396: error: expected expression before ')' token
Registry.xs:397: error: expected expression before ')' token
Registry.xs:398: error: expected expression before ')' token
Registry.xs:399: error: expected expression before ')' token
Registry.xs:400: error: 'uErr' undeclared (first use in this function)
Registry.xs:402: error: 'ERROR_MORE_DATA' undeclared (first use in this function)
Registry.xs:404: error: expected expression before ')' token
Registry.xs:405: error: expected expression before ')' token
Registry.c: In function 'XS_Win32API__Registry__RegEnumKeyExW':
Registry.c:1232: error: 'HKEY' undeclared (first use in this function)
Registry.c:1232: error: expected ';' before 'hKey'
Registry.c:1233: error: 'DWORD' undeclared (first use in this function)
Registry.c:1233: error: expected ';' before 'uIndex'
Registry.c:1234: error: 'WCHAR' undeclared (first use in this function)
Registry.c:1234: error: 'oswName' undeclared (first use in this function)
Registry.c:1235: error: 'iolwName' undeclared (first use in this function)
Registry.c:1236: error: 'pNull' undeclared (first use in this function)
Registry.c:1237: error: 'oswClass' undeclared (first use in this function)
Registry.c:1238: error: 'iolwClass' undeclared (first use in this function)
Registry.c:1239: error: 'FILETIME' undeclared (first use in this function)
Registry.c:1239: error: 'opftLastWrite' undeclared (first use in this function)
Registry.xs:431: error: expected ';' before 'uErr'
Registry.c:1245: error: 'hKey' undeclared (first use in this function)
Registry.c:1245: error: expected ':' before numeric constant
Registry.c:1248: error: 'uIndex' undeclared (first use in this function)
Registry.c:1248: error: expected ':' before numeric constant
Registry.c:1254: error: expected expression before ')' token
Registry.c:1257: error: expected expression before ')' token
Registry.xs:433: error: expected expression before ')' token
Registry.xs:434: error: expected expression before ')' token
Registry.xs:434: error: expected expression before ')' token
Registry.xs:435: error: expected expression before ')' token
Registry.xs:436: error: expected expression before ')' token
Registry.xs:436: error: expected expression before ')' token
Registry.xs:437: error: 'uErr' undeclared (first use in this function)
Registry.xs:439: error: 'ERROR_MORE_DATA' undeclared (first use in this function)
Registry.xs:441: error: expected expression before ')' token
Registry.xs:441: error: expected expression before ')' token
Registry.xs:442: error: expected expression before ')' token
Registry.xs:442: error: expected expression before ')' token
Registry.c: In function 'XS_Win32API__Registry__RegEnumValueA':
Registry.c:1314: error: 'HKEY' undeclared (first use in this function)
Registry.c:1314: error: expected ';' before 'hKey'
Registry.c:1315: error: 'DWORD' undeclared (first use in this function)
Registry.c:1315: error: expected ';' before 'uIndex'
Registry.c:1317: error: 'iolName' undeclared (first use in this function)
Registry.c:1318: error: 'pNull' undeclared (first use in this function)
Registry.c:1319: error: 'ouType' undeclared (first use in this function)
Registry.c:1320: error: 'BYTE' undeclared (first use in this function)
Registry.c:1320: error: 'opData' undeclared (first use in this function)
Registry.c:1321: error: 'iolData' undeclared (first use in this function)
Registry.xs:468: error: expected ';' before 'uErr'
Registry.c:1327: error: 'hKey' undeclared (first use in this function)
Registry.c:1327: error: expected ':' before numeric constant
Registry.c:1330: error: 'uIndex' undeclared (first use in this function)
Registry.c:1330: error: expected ':' before numeric constant
Registry.c:1336: error: expected expression before ')' token
Registry.c:1342: error: expected expression before ')' token
Registry.xs:470: error: expected expression before ')' token
Registry.xs:471: error: expected expression before ')' token
Registry.xs:472: error: expected expression before ')' token
Registry.xs:473: error: expected expression before ')' token
Registry.xs:473: error: expected expression before ')' token
Registry.xs:475: error: expected expression before ')' token
Registry.xs:476: error: 'uErr' undeclared (first use in this function)
Registry.xs:478: error: 'ERROR_MORE_DATA' undeclared (first use in this function)
Registry.xs:480: error: expected expression before ')' token
Registry.xs:481: error: expected expression before ')' token
Registry.xs:481: error: expected expression before ')' token
Registry.xs:488: error: 'REG_SZ' undeclared (first use in this function)
Registry.xs:488: error: 'REG_EXPAND_SZ' undeclared (first use in this function)
Registry.c: In function 'XS_Win32API__Registry__RegEnumValueW':
Registry.c:1408: error: 'HKEY' undeclared (first use in this function)
Registry.c:1408: error: expected ';' before 'hKey'
Registry.c:1409: error: 'DWORD' undeclared (first use in this function)
Registry.c:1409: error: expected ';' before 'uIndex'
Registry.c:1410: error: 'WCHAR' undeclared (first use in this function)
Registry.c:1410: error: 'oswName' undeclared (first use in this function)
Registry.c:1411: error: 'iolwName' undeclared (first use in this function)
Registry.c:1412: error: 'pNull' undeclared (first use in this function)
Registry.c:1413: error: 'ouType' undeclared (first use in this function)
Registry.c:1414: error: 'BYTE' undeclared (first use in this function)
Registry.c:1414: error: 'opData' undeclared (first use in this function)
Registry.c:1415: error: 'iolData' undeclared (first use in this function)
Registry.xs:512: error: expected ';' before 'uErr'
Registry.c:1421: error: 'hKey' undeclared (first use in this function)
Registry.c:1421: error: expected ':' before numeric constant
Registry.c:1424: error: 'uIndex' undeclared (first use in this function)
Registry.c:1424: error: expected ':' before numeric constant
Registry.c:1430: error: expected expression before ')' token
Registry.c:1436: error: expected expression before ')' token
Registry.xs:514: error: expected expression before ')' token
Registry.xs:515: error: expected expression before ')' token
Registry.xs:515: error: expected expression before ')' token
Registry.xs:516: error: expected expression before ')' token
Registry.xs:517: error: expected expression before ')' token
Registry.xs:517: error: expected expression before ')' token
Registry.xs:519: error: expected expression before ')' token
Registry.xs:520: error: 'uErr' undeclared (first use in this function)
Registry.xs:522: error: 'ERROR_MORE_DATA' undeclared (first use in this function)
Registry.xs:524: error: expected expression before ')' token
Registry.xs:524: error: expected expression before ')' token
Registry.xs:525: error: expected expression before ')' token
Registry.xs:525: error: expected expression before ')' token
Registry.xs:532: error: 'REG_SZ' undeclared (first use in this function)
Registry.xs:532: error: 'REG_EXPAND_SZ' undeclared (first use in this function)
Registry.xs:534: error: expected expression before ')' token
Registry.c: In function 'XS_Win32API__Registry_RegFlushKey':
Registry.c:1503: error: 'HKEY' undeclared (first use in this function)
Registry.c:1503: error: expected ';' before 'hKey'
Registry.c:1506: error: 'hKey' undeclared (first use in this function)
Registry.c:1506: error: expected ':' before numeric constant
Registry.c: In function 'XS_Win32API__Registry__RegGetKeySecurity':
Registry.c:1535: error: 'HKEY' undeclared (first use in this function)
Registry.c:1535: error: expected ';' before 'hKey'
Registry.c:1536: error: 'SECURITY_INFORMATION' undeclared (first use in this function)
Registry.c:1536: error: expected ';' before 'uSecInfo'
Registry.c:1537: error: 'SECURITY_DESCRIPTOR' undeclared (first use in this function)
Registry.c:1537: error: 'opSecDesc' undeclared (first use in this function)
Registry.c:1538: error: 'DWORD' undeclared (first use in this function)
Registry.c:1538: error: 'iolSecDesc' undeclared (first use in this function)
Registry.xs:562: error: expected ';' before 'uErr'
Registry.c:1544: error: 'hKey' undeclared (first use in this function)
Registry.c:1544: error: expected ':' before numeric constant
Registry.c:1547: error: 'uSecInfo' undeclared (first use in this function)
Registry.c:1547: error: expected ':' before numeric constant
Registry.xs:564: error: expected expression before ')' token
Registry.xs:565: error: expected expression before ')' token
Registry.xs:565: error: expected expression before ')' token
Registry.xs:567: error: 'uErr' undeclared (first use in this function)
Registry.xs:568: error: 'ERROR_INSUFFICIENT_BUFFER' undeclared (first use in this function)
Registry.xs:569: error: expected expression before ')' token
Registry.xs:569: error: expected expression before ')' token
Registry.c: In function 'XS_Win32API__Registry_RegLoadKeyA':
Registry.c:1592: error: 'HKEY' undeclared (first use in this function)
Registry.c:1592: error: expected ';' before 'hKey'
Registry.c:1597: error: 'hKey' undeclared (first use in this function)
Registry.c:1597: error: expected ':' before numeric constant
Registry.c: In function 'XS_Win32API__Registry_RegLoadKeyW':
Registry.c:1640: error: 'HKEY' undeclared (first use in this function)
Registry.c:1640: error: expected ';' before 'hKey'
Registry.c:1641: error: 'WCHAR' undeclared (first use in this function)
Registry.c:1641: error: 'swSubKey' undeclared (first use in this function)
Registry.c:1642: error: 'swFileName' undeclared (first use in this function)
Registry.c:1645: error: 'hKey' undeclared (first use in this function)
Registry.c:1645: error: expected ':' before numeric constant
Registry.c:1650: error: expected expression before ')' token
Registry.c:1657: error: expected expression before ')' token
Registry.c: In function 'XS_Win32API__Registry_RegNotifyChangeKeyValue':
Registry.c:1688: error: 'HKEY' undeclared (first use in this function)
Registry.c:1688: error: expected ';' before 'hKey'
Registry.c:1689: error: 'BOOL' undeclared (first use in this function)
Registry.c:1689: error: expected ';' before 'bWatchSubtree'
Registry.c:1690: error: 'DWORD' undeclared (first use in this function)
Registry.c:1690: error: expected ';' before 'uNotifyFilter'
Registry.c:1691: error: 'HANDLE' undeclared (first use in this function)
Registry.c:1691: error: expected ';' before 'hEvent'
Registry.c:1692: error: expected ';' before 'bAsync'
Registry.c:1695: error: 'hKey' undeclared (first use in this function)
Registry.c:1695: error: expected ':' before numeric constant
Registry.c:1698: error: 'bWatchSubtree' undeclared (first use in this function)
Registry.c:1698: error: expected ':' before numeric constant
Registry.c:1701: error: 'uNotifyFilter' undeclared (first use in this function)
Registry.c:1701: error: expected ':' before numeric constant
Registry.c:1704: error: 'hEvent' undeclared (first use in this function)
Registry.c:1704: error: expected ':' before numeric constant
Registry.c:1707: error: 'bAsync' undeclared (first use in this function)
Registry.c:1707: error: expected ':' before numeric constant
Registry.c: In function 'XS_Win32API__Registry_RegOpenKeyA':
Registry.c:1737: error: 'HKEY' undeclared (first use in this function)
Registry.c:1737: error: expected ';' before 'hKey'
Registry.c:1739: error: 'ohSubKey' undeclared (first use in this function)
Registry.c:1742: error: 'hKey' undeclared (first use in this function)
Registry.c:1742: error: expected ':' before numeric constant
Registry.c:1755: error: expected expression before ')' token
Registry.c: In function 'XS_Win32API__Registry_RegOpenKeyW':
Registry.c:1788: error: 'HKEY' undeclared (first use in this function)
Registry.c:1788: error: expected ';' before 'hKey'
Registry.c:1789: error: 'WCHAR' undeclared (first use in this function)
Registry.c:1789: error: 'swSubKey' undeclared (first use in this function)
Registry.c:1790: error: 'ohSubKey' undeclared (first use in this function)
Registry.c:1793: error: 'hKey' undeclared (first use in this function)
Registry.c:1793: error: expected ':' before numeric constant
Registry.c:1798: error: expected expression before ')' token
Registry.c:1806: error: expected expression before ')' token
Registry.c: In function 'XS_Win32API__Registry_RegOpenKeyExA':
Registry.c:1839: error: 'HKEY' undeclared (first use in this function)
Registry.c:1839: error: expected ';' before 'hKey'
Registry.c:1841: error: 'DWORD' undeclared (first use in this function)
Registry.c:1841: error: expected ';' before 'uOptions'
Registry.c:1842: error: 'REGSAM' undeclared (first use in this function)
Registry.c:1842: error: expected ';' before 'uAccess'
Registry.c:1843: error: 'ohSubKey' undeclared (first use in this function)
Registry.c:1846: error: 'hKey' undeclared (first use in this function)
Registry.c:1846: error: expected ':' before numeric constant
Registry.c:1856: error: 'uOptions' undeclared (first use in this function)
Registry.c:1856: error: expected ':' before numeric constant
Registry.c:1859: error: 'uAccess' undeclared (first use in this function)
Registry.c:1859: error: expected ':' before numeric constant
Registry.c:1865: error: expected expression before ')' token
Registry.c: In function 'XS_Win32API__Registry_RegOpenKeyExW':
Registry.c:1899: error: 'HKEY' undeclared (first use in this function)
Registry.c:1899: error: expected ';' before 'hKey'
Registry.c:1900: error: 'WCHAR' undeclared (first use in this function)
Registry.c:1900: error: 'swSubKey' undeclared (first use in this function)
Registry.c:1901: error: 'DWORD' undeclared (first use in this function)
Registry.c:1901: error: expected ';' before 'uOptions'
Registry.c:1902: error: 'REGSAM' undeclared (first use in this function)
Registry.c:1902: error: expected ';' before 'uAccess'
Registry.c:1903: error: 'ohSubKey' undeclared (first use in this function)
Registry.c:1906: error: 'hKey' undeclared (first use in this function)
Registry.c:1906: error: expected ':' before numeric constant
Registry.c:1911: error: expected expression before ')' token
Registry.c:1916: error: 'uOptions' undeclared (first use in this function)
Registry.c:1916: error: expected ':' before numeric constant
Registry.c:1919: error: 'uAccess' undeclared (first use in this function)
Registry.c:1919: error: expected ':' before numeric constant
Registry.c:1925: error: expected expression before ')' token
Registry.c: In function 'XS_Win32API__Registry__RegQueryInfoKeyA':
Registry.c:1959: error: 'HKEY' undeclared (first use in this function)
Registry.c:1959: error: expected ';' before 'hKey'
Registry.c:1961: error: 'DWORD' undeclared (first use in this function)
Registry.c:1961: error: 'iolClass' undeclared (first use in this function)
Registry.c:1962: error: 'pNull' undeclared (first use in this function)
Registry.c:1963: error: 'ocSubKeys' undeclared (first use in this function)
Registry.c:1964: error: 'olSubKey' undeclared (first use in this function)
Registry.c:1965: error: 'olSubClass' undeclared (first use in this function)
Registry.c:1966: error: 'ocValues' undeclared (first use in this function)
Registry.c:1967: error: 'olValName' undeclared (first use in this function)
Registry.c:1968: error: 'olValData' undeclared (first use in this function)
Registry.c:1969: error: 'olSecDesc' undeclared (first use in this function)
Registry.c:1970: error: 'FILETIME' undeclared (first use in this function)
Registry.c:1970: error: 'opftTime' undeclared (first use in this function)
Registry.xs:687: error: expected ';' before 'uErr'
Registry.c:1976: error: 'hKey' undeclared (first use in this function)
Registry.c:1976: error: expected ':' before numeric constant
Registry.c:1982: error: expected expression before ')' token
Registry.c:1988: error: expected expression before ')' token
Registry.c:1995: error: expected expression before ')' token
Registry.c:2002: error: expected expression before ')' token
Registry.c:2009: error: expected expression before ')' token
Registry.c:2016: error: expected expression before ')' token
Registry.c:2023: error: expected expression before ')' token
Registry.c:2030: error: expected expression before ')' token
Registry.c:2034: error: expected expression before ')' token
Registry.xs:689: error: expected expression before ')' token
Registry.xs:690: error: expected expression before ')' token
Registry.xs:691: error: 'uErr' undeclared (first use in this function)
Registry.xs:694: error: 'ERROR_MORE_DATA' undeclared (first use in this function)
Registry.xs:695: error: expected expression before ')' token
Registry.c: In function 'XS_Win32API__Registry__RegQueryInfoKeyW':
Registry.c:2105: error: 'HKEY' undeclared (first use in this function)
Registry.c:2105: error: expected ';' before 'hKey'
Registry.c:2106: error: 'WCHAR' undeclared (first use in this function)
Registry.c:2106: error: 'oswClass' undeclared (first use in this function)
Registry.c:2107: error: 'DWORD' undeclared (first use in this function)
Registry.c:2107: error: 'iolwClass' undeclared (first use in this function)
Registry.c:2108: error: 'pNull' undeclared (first use in this function)
Registry.c:2109: error: 'ocSubKeys' undeclared (first use in this function)
Registry.c:2110: error: 'olwSubKey' undeclared (first use in this function)
Registry.c:2111: error: 'olwSubClass' undeclared (first use in this function)
Registry.c:2112: error: 'ocValues' undeclared (first use in this function)
Registry.c:2113: error: 'olwValName' undeclared (first use in this function)
Registry.c:2114: error: 'olValData' undeclared (first use in this function)
Registry.c:2115: error: 'olSecDesc' undeclared (first use in this function)
Registry.c:2116: error: 'FILETIME' undeclared (first use in this function)
Registry.c:2116: error: 'opftTime' undeclared (first use in this function)
Registry.xs:731: error: expected ';' before 'uErr'
Registry.c:2122: error: 'hKey' undeclared (first use in this function)
Registry.c:2122: error: expected ':' before numeric constant
Registry.c:2128: error: expected expression before ')' token
Registry.c:2134: error: expected expression before ')' token
Registry.c:2141: error: expected expression before ')' token
Registry.c:2148: error: expected expression before ')' token
Registry.c:2155: error: expected expression before ')' token
Registry.c:2162: error: expected expression before ')' token
Registry.c:2169: error: expected expression before ')' token
Registry.c:2176: error: expected expression before ')' token
Registry.c:2180: error: expected expression before ')' token
Registry.xs:733: error: expected expression before ')' token
Registry.xs:734: error: expected expression before ')' token
Registry.xs:734: error: expected expression before ')' token
Registry.xs:735: error: 'uErr' undeclared (first use in this function)
Registry.xs:738: error: 'ERROR_MORE_DATA' undeclared (first use in this function)
Registry.xs:739: error: expected expression before ')' token
Registry.xs:739: error: expected expression before ')' token
Registry.c: In function 'XS_Win32API__Registry__RegQueryMultipleValuesA':
Registry.c:2251: error: 'HKEY' undeclared (first use in this function)
Registry.c:2251: error: expected ';' before 'hKey'
Registry.c:2252: error: 'VALENT' undeclared (first use in this function)
Registry.c:2252: error: 'ioarValueEnts' undeclared (first use in this function)
Registry.c:2253: error: 'DWORD' undeclared (first use in this function)
Registry.c:2253: error: expected ';' before 'icValueEnts'
Registry.c:2255: error: 'iolBuffer' undeclared (first use in this function)
Registry.xs:767: error: expected ';' before 'uErr'
Registry.c:2261: error: 'hKey' undeclared (first use in this function)
Registry.c:2261: error: expected ':' before numeric constant
Registry.c:2266: error: expected expression before ')' token
Registry.c:2271: error: 'icValueEnts' undeclared (first use in this function)
Registry.c:2271: error: expected ':' before numeric constant
Registry.xs:780: error: expected expression before ')' token
Registry.xs:781: error: expected expression before ')' token
Registry.xs:782: error: 'uErr' undeclared (first use in this function)
Registry.xs:784: error: 'ERROR_MORE_DATA' undeclared (first use in this function)
Registry.xs:785: error: expected expression before ')' token
Registry.c: In function 'XS_Win32API__Registry__RegQueryMultipleValuesW':
Registry.c:2325: error: 'HKEY' undeclared (first use in this function)
Registry.c:2325: error: expected ';' before 'hKey'
Registry.c:2326: error: 'VALENTW' undeclared (first use in this function)
Registry.c:2326: error: 'ioarValueEnts' undeclared (first use in this function)
Registry.c:2327: error: 'DWORD' undeclared (first use in this function)
Registry.c:2327: error: expected ';' before 'icValueEnts'
Registry.c:2328: error: 'WCHAR' undeclared (first use in this function)
Registry.c:2328: error: 'opBuffer' undeclared (first use in this function)
Registry.c:2329: error: 'iolBuffer' undeclared (first use in this function)
Registry.xs:804: error: expected ';' before 'uErr'
Registry.c:2335: error: 'hKey' undeclared (first use in this function)
Registry.c:2335: error: expected ':' before numeric constant
Registry.c:2340: error: expected expression before ')' token
Registry.c:2345: error: 'icValueEnts' undeclared (first use in this function)
Registry.c:2345: error: expected ':' before numeric constant
Registry.xs:817: error: expected expression before ')' token
Registry.xs:818: error: expected expression before ')' token
Registry.xs:818: error: expected expression before ')' token
Registry.xs:819: error: 'uErr' undeclared (first use in this function)
Registry.xs:821: error: 'ERROR_MORE_DATA' undeclared (first use in this function)
Registry.xs:822: error: expected expression before ')' token
Registry.xs:822: error: expected expression before ')' token
Registry.c: In function 'XS_Win32API__Registry__RegQueryValueA':
Registry.c:2399: error: 'HKEY' undeclared (first use in this function)
Registry.c:2399: error: expected ';' before 'hKey'
Registry.c:2402: error: 'LONG' undeclared (first use in this function)
Registry.c:2402: error: 'iolValueData' undeclared (first use in this function)
Registry.xs:840: error: 'DWORD' undeclared (first use in this function)
Registry.xs:840: error: expected ';' before 'uErr'
Registry.c:2408: error: 'hKey' undeclared (first use in this function)
Registry.c:2408: error: expected ':' before numeric constant
Registry.xs:842: error: expected expression before ')' token
Registry.xs:843: error: expected expression before ')' token
Registry.xs:844: error: 'uErr' undeclared (first use in this function)
Registry.xs:845: error: 'ERROR_MORE_DATA' undeclared (first use in this function)
Registry.xs:846: error: expected expression before ')' token
Registry.c: In function 'XS_Win32API__Registry__RegQueryValueW':
Registry.c:2456: error: 'HKEY' undeclared (first use in this function)
Registry.c:2456: error: expected ';' before 'hKey'
Registry.c:2457: error: 'WCHAR' undeclared (first use in this function)
Registry.c:2457: error: 'swSubKey' undeclared (first use in this function)
Registry.c:2458: error: 'oswValueData' undeclared (first use in this function)
Registry.c:2459: error: 'LONG' undeclared (first use in this function)
Registry.c:2459: error: 'iolValueData' undeclared (first use in this function)
Registry.xs:863: error: 'DWORD' undeclared (first use in this function)
Registry.xs:863: error: expected ';' before 'uErr'
Registry.c:2465: error: 'hKey' undeclared (first use in this function)
Registry.c:2465: error: expected ':' before numeric constant
Registry.c:2470: error: expected expression before ')' token
Registry.xs:865: error: expected expression before ')' token
Registry.xs:866: error: expected expression before ')' token
Registry.xs:866: error: expected expression before ')' token
Registry.xs:867: error: 'uErr' undeclared (first use in this function)
Registry.xs:868: error: 'ERROR_MORE_DATA' undeclared (first use in this function)
Registry.xs:869: error: expected expression before ')' token
Registry.xs:869: error: expected expression before ')' token
Registry.c: In function 'XS_Win32API__Registry__RegQueryValueExA':
Registry.c:2514: error: 'HKEY' undeclared (first use in this function)
Registry.c:2514: error: expected ';' before 'hKey'
Registry.c:2516: error: 'DWORD' undeclared (first use in this function)
Registry.c:2516: error: 'pNull' undeclared (first use in this function)
Registry.c:2517: error: 'ouType' undeclared (first use in this function)
Registry.c:2518: error: 'BYTE' undeclared (first use in this function)
Registry.c:2518: error: 'opData' undeclared (first use in this function)
Registry.c:2519: error: 'iolData' undeclared (first use in this function)
Registry.xs:889: error: expected ';' before 'uErr'
Registry.c:2525: error: 'hKey' undeclared (first use in this function)
Registry.c:2525: error: expected ':' before numeric constant
Registry.c:2538: error: expected expression before ')' token
Registry.c:2544: error: expected expression before ')' token
Registry.xs:892: error: expected expression before ')' token
Registry.xs:893: error: expected expression before ')' token
Registry.xs:894: error: expected expression before ')' token
Registry.xs:894: error: expected expression before ')' token
Registry.xs:895: error: 'uErr' undeclared (first use in this function)
Registry.xs:897: error: 'ERROR_MORE_DATA' undeclared (first use in this function)
Registry.xs:898: error: expected expression before ')' token
Registry.xs:898: error: expected expression before ')' token
Registry.xs:905: error: 'REG_SZ' undeclared (first use in this function)
Registry.xs:905: error: 'REG_EXPAND_SZ' undeclared (first use in this function)
Registry.c: In function 'XS_Win32API__Registry__RegQueryValueExW':
Registry.c:2601: error: 'HKEY' undeclared (first use in this function)
Registry.c:2601: error: expected ';' before 'hKey'
Registry.c:2602: error: 'WCHAR' undeclared (first use in this function)
Registry.c:2602: error: 'swName' undeclared (first use in this function)
Registry.c:2603: error: 'DWORD' undeclared (first use in this function)
Registry.c:2603: error: 'pNull' undeclared (first use in this function)
Registry.c:2604: error: 'ouType' undeclared (first use in this function)
Registry.c:2605: error: 'BYTE' undeclared (first use in this function)
Registry.c:2605: error: 'opData' undeclared (first use in this function)
Registry.c:2606: error: 'iolData' undeclared (first use in this function)
Registry.xs:925: error: expected ';' before 'uErr'
Registry.c:2612: error: 'hKey' undeclared (first use in this function)
Registry.c:2612: error: expected ':' before numeric constant
Registry.c:2617: error: expected expression before ')' token
Registry.c:2625: error: expected expression before ')' token
Registry.c:2631: error: expected expression before ')' token
Registry.xs:928: error: expected expression before ')' token
Registry.xs:929: error: expected expression before ')' token
Registry.xs:930: error: expected expression before ')' token
Registry.xs:930: error: expected expression before ')' token
Registry.xs:931: error: 'uErr' undeclared (first use in this function)
Registry.xs:933: error: 'ERROR_MORE_DATA' undeclared (first use in this function)
Registry.xs:934: error: expected expression before ')' token
Registry.xs:934: error: expected expression before ')' token
Registry.xs:941: error: 'REG_SZ' undeclared (first use in this function)
Registry.xs:941: error: 'REG_EXPAND_SZ' undeclared (first use in this function)
Registry.xs:943: error: expected expression before ')' token
Registry.c: In function 'XS_Win32API__Registry_RegReplaceKeyA':
Registry.c:2689: error: 'HKEY' undeclared (first use in this function)
Registry.c:2689: error: expected ';' before 'hKey'
Registry.c:2695: error: 'hKey' undeclared (first use in this function)
Registry.c:2695: error: expected ':' before numeric constant
Registry.c: In function 'XS_Win32API__Registry_RegReplaceKeyW':
Registry.c:2746: error: 'HKEY' undeclared (first use in this function)
Registry.c:2746: error: expected ';' before 'hKey'
Registry.c:2747: error: 'WCHAR' undeclared (first use in this function)
Registry.c:2747: error: 'swSubKey' undeclared (first use in this function)
Registry.c:2748: error: 'swNewFile' undeclared (first use in this function)
Registry.c:2749: error: 'swOldFile' undeclared (first use in this function)
Registry.c:2752: error: 'hKey' undeclared (first use in this function)
Registry.c:2752: error: expected ':' before numeric constant
Registry.c:2757: error: expected expression before ')' token
Registry.c:2764: error: expected expression before ')' token
Registry.c:2771: error: expected expression before ')' token
Registry.c: In function 'XS_Win32API__Registry_RegRestoreKeyA':
Registry.c:2803: error: 'HKEY' undeclared (first use in this function)
Registry.c:2803: error: expected ';' before 'hKey'
Registry.c:2805: error: 'DWORD' undeclared (first use in this function)
Registry.c:2805: error: expected ';' before 'uFlags'
Registry.c:2808: error: 'hKey' undeclared (first use in this function)
Registry.c:2808: error: expected ':' before numeric constant
Registry.c:2818: error: 'uFlags' undeclared (first use in this function)
Registry.c:2818: error: expected ':' before numeric constant
Registry.c: In function 'XS_Win32API__Registry_RegRestoreKeyW':
Registry.c:2847: error: 'HKEY' undeclared (first use in this function)
Registry.c:2847: error: expected ';' before 'hKey'
Registry.c:2848: error: 'WCHAR' undeclared (first use in this function)
Registry.c:2848: error: 'swFileName' undeclared (first use in this function)
Registry.c:2849: error: 'DWORD' undeclared (first use in this function)
Registry.c:2849: error: expected ';' before 'uFlags'
Registry.c:2852: error: 'hKey' undeclared (first use in this function)
Registry.c:2852: error: expected ':' before numeric constant
Registry.c:2857: error: expected expression before ')' token
Registry.c:2862: error: 'uFlags' undeclared (first use in this function)
Registry.c:2862: error: expected ':' before numeric constant
Registry.c: In function 'XS_Win32API__Registry_RegSaveKeyA':
Registry.c:2891: error: 'HKEY' undeclared (first use in this function)
Registry.c:2891: error: expected ';' before 'hKey'
Registry.c:2893: error: 'SECURITY_ATTRIBUTES' undeclared (first use in this function)
Registry.c:2893: error: 'pSecAttr' undeclared (first use in this function)
Registry.c:2896: error: 'hKey' undeclared (first use in this function)
Registry.c:2896: error: expected ':' before numeric constant
Registry.c:2908: error: expected expression before ')' token
Registry.c: In function 'XS_Win32API__Registry_RegSaveKeyW':
Registry.c:2939: error: 'HKEY' undeclared (first use in this function)
Registry.c:2939: error: expected ';' before 'hKey'
Registry.c:2940: error: 'WCHAR' undeclared (first use in this function)
Registry.c:2940: error: 'swFileName' undeclared (first use in this function)
Registry.c:2941: error: 'SECURITY_ATTRIBUTES' undeclared (first use in this function)
Registry.c:2941: error: 'pSecAttr' undeclared (first use in this function)
Registry.c:2944: error: 'hKey' undeclared (first use in this function)
Registry.c:2944: error: expected ':' before numeric constant
Registry.c:2949: error: expected expression before ')' token
Registry.c:2956: error: expected expression before ')' token
Registry.c: In function 'XS_Win32API__Registry_RegSetKeySecurity':
Registry.c:2987: error: 'HKEY' undeclared (first use in this function)
Registry.c:2987: error: expected ';' before 'hKey'
Registry.c:2988: error: 'SECURITY_INFORMATION' undeclared (first use in this function)
Registry.c:2988: error: expected ';' before 'uSecInfo'
Registry.c:2989: error: 'SECURITY_DESCRIPTOR' undeclared (first use in this function)
Registry.c:2989: error: 'pSecDesc' undeclared (first use in this function)
Registry.c:2992: error: 'hKey' undeclared (first use in this function)
Registry.c:2992: error: expected ':' before numeric constant
Registry.c:2995: error: 'uSecInfo' undeclared (first use in this function)
Registry.c:2995: error: expected ':' before numeric constant
Registry.c:3000: error: expected expression before ')' token
Registry.c: In function 'XS_Win32API__Registry__RegSetValueA':
Registry.c:3031: error: 'HKEY' undeclared (first use in this function)
Registry.c:3031: error: expected ';' before 'hKey'
Registry.c:3033: error: 'DWORD' undeclared (first use in this function)
Registry.c:3033: error: expected ';' before 'uType'
Registry.c:3035: error: expected ';' before 'lValueData'
Registry.c:3038: error: 'hKey' undeclared (first use in this function)
Registry.c:3038: error: expected ':' before numeric constant
Registry.c:3048: error: 'uType' undeclared (first use in this function)
Registry.c:3048: error: expected ':' before numeric constant
Registry.c:3058: error: 'lValueData' undeclared (first use in this function)
Registry.c:3058: error: expected ':' before numeric constant
Registry.c: In function 'XS_Win32API__Registry__RegSetValueW':
Registry.c:3090: error: 'HKEY' undeclared (first use in this function)
Registry.c:3090: error: expected ';' before 'hKey'
Registry.c:3091: error: 'WCHAR' undeclared (first use in this function)
Registry.c:3091: error: 'swSubKey' undeclared (first use in this function)
Registry.c:3092: error: 'DWORD' undeclared (first use in this function)
Registry.c:3092: error: expected ';' before 'uType'
Registry.c:3093: error: 'swValueData' undeclared (first use in this function)
Registry.c:3094: error: expected ';' before 'lValueData'
Registry.c:3097: error: 'hKey' undeclared (first use in this function)
Registry.c:3097: error: expected ':' before numeric constant
Registry.c:3102: error: expected expression before ')' token
Registry.c:3107: error: 'uType' undeclared (first use in this function)
Registry.c:3107: error: expected ':' before numeric constant
Registry.c:3112: error: expected expression before ')' token
Registry.c:3117: error: 'lValueData' undeclared (first use in this function)
Registry.c:3117: error: expected ':' before numeric constant
Registry.c: In function 'XS_Win32API__Registry__RegSetValueExA':
Registry.c:3149: error: 'HKEY' undeclared (first use in this function)
Registry.c:3149: error: expected ';' before 'hKey'
Registry.c:3151: error: 'DWORD' undeclared (first use in this function)
Registry.c:3151: error: expected ';' before 'uZero'
Registry.c:3152: error: expected ';' before 'uType'
Registry.c:3153: error: 'BYTE' undeclared (first use in this function)
Registry.c:3153: error: 'pData' undeclared (first use in this function)
Registry.c:3154: error: expected ';' before 'lData'
Registry.c:3157: error: 'hKey' undeclared (first use in this function)
Registry.c:3157: error: expected ':' before numeric constant
Registry.c:3167: error: 'uZero' undeclared (first use in this function)
Registry.c:3167: error: expected ':' before numeric constant
Registry.c:3170: error: 'uType' undeclared (first use in this function)
Registry.c:3170: error: expected ':' before numeric constant
Registry.c:3175: error: expected expression before ')' token
Registry.c:3180: error: 'lData' undeclared (first use in this function)
Registry.c:3180: error: expected ':' before numeric constant
Registry.xs:1077: error: 'REG_SZ' undeclared (first use in this function)
Registry.xs:1077: error: 'REG_EXPAND_SZ' undeclared (first use in this function)
Registry.c: In function 'XS_Win32API__Registry__RegSetValueExW':
Registry.c:3217: error: 'HKEY' undeclared (first use in this function)
Registry.c:3217: error: expected ';' before 'hKey'
Registry.c:3218: error: 'WCHAR' undeclared (first use in this function)
Registry.c:3218: error: 'swName' undeclared (first use in this function)
Registry.c:3219: error: 'DWORD' undeclared (first use in this function)
Registry.c:3219: error: expected ';' before 'uZero'
Registry.c:3220: error: expected ';' before 'uType'
Registry.c:3221: error: 'BYTE' undeclared (first use in this function)
Registry.c:3221: error: 'pData' undeclared (first use in this function)
Registry.c:3222: error: expected ';' before 'lData'
Registry.c:3225: error: 'hKey' undeclared (first use in this function)
Registry.c:3225: error: expected ':' before numeric constant
Registry.c:3230: error: expected expression before ')' token
Registry.c:3235: error: 'uZero' undeclared (first use in this function)
Registry.c:3235: error: expected ':' before numeric constant
Registry.c:3238: error: 'uType' undeclared (first use in this function)
Registry.c:3238: error: expected ':' before numeric constant
Registry.c:3243: error: expected expression before ')' token
Registry.c:3248: error: 'lData' undeclared (first use in this function)
Registry.c:3248: error: expected ':' before numeric constant
Registry.xs:1099: error: 'REG_SZ' undeclared (first use in this function)
Registry.xs:1099: error: 'REG_EXPAND_SZ' undeclared (first use in this function)
Registry.xs:1100: error: expected expression before ')' token
Registry.c: In function 'XS_Win32API__Registry_RegUnLoadKeyA':
Registry.c:3286: error: 'HKEY' undeclared (first use in this function)
Registry.c:3286: error: expected ';' before 'hKey'
Registry.c:3290: error: 'hKey' undeclared (first use in this function)
Registry.c:3290: error: expected ':' before numeric constant
Registry.c: In function 'XS_Win32API__Registry_RegUnLoadKeyW':
Registry.c:3326: error: 'HKEY' undeclared (first use in this function)
Registry.c:3326: error: expected ';' before 'hKey'
Registry.c:3327: error: 'WCHAR' undeclared (first use in this function)
Registry.c:3327: error: 'swSubKey' undeclared (first use in this function)
Registry.c:3330: error: 'hKey' undeclared (first use in this function)
Registry.c:3330: error: expected ':' before numeric constant
Registry.c:3335: error: expected expression before ')' token
Registry.xs:17:21: error: windows.h: No such file or directory
Registry.xs:90: error: expected '=', ',', ';', 'asm' or '__attribute__' before 'uLastRegErr'
Registry.xs:93: error: expected ')' before 'uErr'
Registry.c: In function 'XS_Win32API__Registry__regLastError':
Registry.c:186: error: 'DWORD' undeclared (first use in this function)
Registry.c:186: error: (Each undeclared identifier is reported only once
Registry.c:186: error: for each function it appears in.)
Registry.c:186: error: expected ';' before 'uError'
Registry.c:187: error: 'LONG' undeclared (first use in this function)
Registry.c:187: error: expected ';' before 'RETVAL'
Registry.c:190: error: 'uError' undeclared (first use in this function)
Registry.c:192: error: expected ':' before numeric constant
Registry.xs:114: error: 'uLastRegErr' undeclared (first use in this function)
Registry.xs:116: error: 'RETVAL' undeclared (first use in this function)
Registry.c: In function 'XS_Win32API__Registry_AllowPriv':
Registry.c:221: error: 'BOOL' undeclared (first use in this function)
Registry.c:221: error: expected ';' before 'bEnable'
Registry.xs:126: error: 'HANDLE' undeclared (first use in this function)
Registry.xs:126: error: expected ';' before 'hToken'
Registry.xs:127: error: 'TOKEN_PRIVILEGES' undeclared (first use in this function)
Registry.xs:127: error: expected ';' before 'tokPrivNew'
Registry.c:235: error: 'bEnable' undeclared (first use in this function)
Registry.c:235: error: expected ':' before numeric constant
Registry.xs:129: error: 'tokPrivNew' undeclared (first use in this function)
Registry.xs:131: error: 'SE_PRIVILEGE_ENABLED' undeclared (first use in this function)
Registry.xs:137: error: 'TOKEN_ADJUST_PRIVILEGES' undeclared (first use in this function)
Registry.xs:137: error: 'hToken' undeclared (first use in this function)
Registry.xs:141: error: 'ERROR_SUCCESS' undeclared (first use in this function)
Registry.xs:149: error: 'INVALID_HANDLE_VALUE' undeclared (first use in this function)
Registry.xs:150: error: 'DWORD' undeclared (first use in this function)
Registry.xs:150: error: expected ';' before 'uErr'
Registry.xs:152: error: 'uErr' undeclared (first use in this function)
Registry.xs:154: error: 'uLastRegErr' undeclared (first use in this function)
Registry.c: In function 'XS_Win32API__Registry_AbortSystemShutdownA':
Registry.c:291: error: 'BOOL' undeclared (first use in this function)
Registry.c:291: error: expected ';' before 'RETVAL'
Registry.xs:164: error: 'RETVAL' undeclared (first use in this function)
Registry.xs:166: error: 'uLastRegErr' undeclared (first use in this function)
Registry.c: In function 'XS_Win32API__Registry_AbortSystemShutdownW':
Registry.c:329: error: 'WCHAR' undeclared (first use in this function)
Registry.c:329: error: 'swComputerName' undeclared (first use in this function)
Registry.c:330: error: 'BOOL' undeclared (first use in this function)
Registry.c:330: error: expected ';' before 'RETVAL'
Registry.c:334: error: expected expression before ')' token
Registry.xs:176: error: 'RETVAL' undeclared (first use in this function)
Registry.xs:178: error: 'uLastRegErr' undeclared (first use in this function)
Registry.c: In function 'XS_Win32API__Registry_InitiateSystemShutdownA':
Registry.c:370: error: 'DWORD' undeclared (first use in this function)
Registry.c:370: error: expected ';' before 'uTimeoutSecs'
Registry.c:371: error: 'BOOL' undeclared (first use in this function)
Registry.c:371: error: expected ';' before 'bForce'
Registry.c:372: error: expected ';' before 'bReboot'
Registry.c:373: error: expected ';' before 'RETVAL'
Registry.c:389: error: 'uTimeoutSecs' undeclared (first use in this function)
Registry.c:389: error: expected ':' before numeric constant
Registry.c:392: error: 'bForce' undeclared (first use in this function)
Registry.c:392: error: expected ':' before numeric constant
Registry.c:395: error: 'bReboot' undeclared (first use in this function)
Registry.c:395: error: expected ':' before numeric constant
Registry.xs:192: error: 'RETVAL' undeclared (first use in this function)
Registry.xs:195: error: 'uLastRegErr' undeclared (first use in this function)
Registry.c: In function 'XS_Win32API__Registry_InitiateSystemShutdownW':
Registry.c:428: error: 'WCHAR' undeclared (first use in this function)
Registry.c:428: error: 'swComputer' undeclared (first use in this function)
Registry.c:429: error: 'swMessage' undeclared (first use in this function)
Registry.c:430: error: 'DWORD' undeclared (first use in this function)
Registry.c:430: error: expected ';' before 'uTimeoutSecs'
Registry.c:431: error: 'BOOL' undeclared (first use in this function)
Registry.c:431: error: expected ';' before 'bForce'
Registry.c:432: error: expected ';' before 'bReboot'
Registry.c:433: error: expected ';' before 'RETVAL'
Registry.c:437: error: expected expression before ')' token
Registry.c:444: error: expected expression before ')' token
Registry.c:449: error: 'uTimeoutSecs' undeclared (first use in this function)
Registry.c:449: error: expected ':' before numeric constant
Registry.c:452: error: 'bForce' undeclared (first use in this function)
Registry.c:452: error: expected ':' before numeric constant
Registry.c:455: error: 'bReboot' undeclared (first use in this function)
Registry.c:455: error: expected ':' before numeric constant
Registry.xs:209: error: 'RETVAL' undeclared (first use in this function)
Registry.xs:212: error: 'uLastRegErr' undeclared (first use in this function)
Registry.c: In function 'XS_Win32API__Registry_RegCloseKey':
Registry.c:488: error: 'HKEY' undeclared (first use in this function)
Registry.c:488: error: expected ';' before 'hKey'
Registry.c:491: error: 'hKey' undeclared (first use in this function)
Registry.c:491: error: expected ':' before numeric constant
Registry.c: In function 'XS_Win32API__Registry_RegConnectRegistryA':
Registry.c:521: error: 'HKEY' undeclared (first use in this function)
Registry.c:521: error: expected ';' before 'hRootKey'
Registry.c:522: error: 'ohKey' undeclared (first use in this function)
Registry.c:532: error: 'hRootKey' undeclared (first use in this function)
Registry.c:532: error: expected ':' before numeric constant
Registry.c:538: error: expected expression before ')' token
Registry.c: In function 'XS_Win32API__Registry_RegConnectRegistryW':
Registry.c:572: error: 'WCHAR' undeclared (first use in this function)
Registry.c:572: error: 'swComputer' undeclared (first use in this function)
Registry.c:573: error: 'HKEY' undeclared (first use in this function)
Registry.c:573: error: expected ';' before 'hRootKey'
Registry.c:574: error: 'ohKey' undeclared (first use in this function)
Registry.c:579: error: expected expression before ')' token
Registry.c:584: error: 'hRootKey' undeclared (first use in this function)
Registry.c:584: error: expected ':' before numeric constant
Registry.c:590: error: expected expression before ')' token
Registry.c: In function 'XS_Win32API__Registry_RegCreateKeyA':
Registry.c:623: error: 'HKEY' undeclared (first use in this function)
Registry.c:623: error: expected ';' before 'hKey'
Registry.c:625: error: 'ohSubKey' undeclared (first use in this function)
Registry.c:628: error: 'hKey' undeclared (first use in this function)
Registry.c:628: error: expected ':' before numeric constant
Registry.c:641: error: expected expression before ')' token
Registry.c: In function 'XS_Win32API__Registry_RegCreateKeyW':
Registry.c:674: error: 'HKEY' undeclared (first use in this function)
Registry.c:674: error: expected ';' before 'hKey'
Registry.c:675: error: 'WCHAR' undeclared (first use in this function)
Registry.c:675: error: 'swSubKey' undeclared (first use in this function)
Registry.c:676: error: 'ohSubKey' undeclared (first use in this function)
Registry.c:679: error: 'hKey' undeclared (first use in this function)
Registry.c:679: error: expected ':' before numeric constant
Registry.c:684: error: expected expression before ')' token
Registry.c:692: error: expected expression before ')' token
Registry.c: In function 'XS_Win32API__Registry_RegCreateKeyExA':
Registry.c:725: error: 'HKEY' undeclared (first use in this function)
Registry.c:725: error: expected ';' before 'hKey'
Registry.c:727: error: 'DWORD' undeclared (first use in this function)
Registry.c:727: error: expected ';' before 'uZero'
Registry.c:729: error: expected ';' before 'uOpts'
Registry.c:730: error: 'REGSAM' undeclared (first use in this function)
Registry.c:730: error: expected ';' before 'uAccess'
Registry.c:732: error: 'ohNewKey' undeclared (first use in this function)
Registry.c:733: error: 'ouDisp' undeclared (first use in this function)
Registry.c:736: error: 'hKey' undeclared (first use in this function)
Registry.c:736: error: expected ':' before numeric constant
Registry.c:746: error: 'uZero' undeclared (first use in this function)
Registry.c:746: error: expected ':' before numeric constant
Registry.c:756: error: 'uOpts' undeclared (first use in this function)
Registry.c:756: error: expected ':' before numeric constant
Registry.c:759: error: 'uAccess' undeclared (first use in this function)
Registry.c:759: error: expected ':' before numeric constant
Registry.c:772: error: expected expression before ')' token
Registry.c:779: error: expected expression before ')' token
Registry.xs:290: error: 'SECURITY_ATTRIBUTES' undeclared (first use in this function)
Registry.xs:290: error: expected expression before ')' token
Registry.c: In function 'XS_Win32API__Registry_RegCreateKeyExW':
Registry.c:817: error: 'HKEY' undeclared (first use in this function)
Registry.c:817: error: expected ';' before 'hKey'
Registry.c:818: error: 'WCHAR' undeclared (first use in this function)
Registry.c:818: error: 'swSubKey' undeclared (first use in this function)
Registry.c:819: error: 'DWORD' undeclared (first use in this function)
Registry.c:819: error: expected ';' before 'uZero'
Registry.c:820: error: 'swClass' undeclared (first use in this function)
Registry.c:821: error: expected ';' before 'uOpts'
Registry.c:822: error: 'REGSAM' undeclared (first use in this function)
Registry.c:822: error: expected ';' before 'uAccess'
Registry.c:824: error: 'ohNewKey' undeclared (first use in this function)
Registry.c:825: error: 'ouDisp' undeclared (first use in this function)
Registry.c:828: error: 'hKey' undeclared (first use in this function)
Registry.c:828: error: expected ':' before numeric constant
Registry.c:833: error: expected expression before ')' token
Registry.c:838: error: 'uZero' undeclared (first use in this function)
Registry.c:838: error: expected ':' before numeric constant
Registry.c:843: error: expected expression before ')' token
Registry.c:848: error: 'uOpts' undeclared (first use in this function)
Registry.c:848: error: expected ':' before numeric constant
Registry.c:851: error: 'uAccess' undeclared (first use in this function)
Registry.c:851: error: expected ':' before numeric constant
Registry.c:864: error: expected expression before ')' token
Registry.c:871: error: expected expression before ')' token
Registry.xs:311: error: 'SECURITY_ATTRIBUTES' undeclared (first use in this function)
Registry.xs:311: error: expected expression before ')' token
Registry.c: In function 'XS_Win32API__Registry_RegDeleteKeyA':
Registry.c:909: error: 'HKEY' undeclared (first use in this function)
Registry.c:909: error: expected ';' before 'hKey'
Registry.c:913: error: 'hKey' undeclared (first use in this function)
Registry.c:913: error: expected ':' before numeric constant
Registry.c: In function 'XS_Win32API__Registry_RegDeleteKeyW':
Registry.c:949: error: 'HKEY' undeclared (first use in this function)
Registry.c:949: error: expected ';' before 'hKey'
Registry.c:950: error: 'WCHAR' undeclared (first use in this function)
Registry.c:950: error: 'swSubKey' undeclared (first use in this function)
Registry.c:953: error: 'hKey' undeclared (first use in this function)
Registry.c:953: error: expected ':' before numeric constant
Registry.c:958: error: expected expression before ')' token
Registry.c: In function 'XS_Win32API__Registry_RegDeleteValueA':
Registry.c:989: error: 'HKEY' undeclared (first use in this function)
Registry.c:989: error: expected ';' before 'hKey'
Registry.c:993: error: 'hKey' undeclared (first use in this function)
Registry.c:993: error: expected ':' before numeric constant
Registry.c: In function 'XS_Win32API__Registry_RegDeleteValueW':
Registry.c:1029: error: 'HKEY' undeclared (first use in this function)
Registry.c:1029: error: expected ';' before 'hKey'
Registry.c:1030: error: 'WCHAR' undeclared (first use in this function)
Registry.c:1030: error: 'swValueName' undeclared (first use in this function)
Registry.c:1033: error: 'hKey' undeclared (first use in this function)
Registry.c:1033: error: expected ':' before numeric constant
Registry.c:1038: error: expected expression before ')' token
Registry.c: In function 'XS_Win32API__Registry__RegEnumKeyA':
Registry.c:1068: error: 'HKEY' undeclared (first use in this function)
Registry.c:1068: error: expected ';' before 'hKey'
Registry.c:1069: error: 'DWORD' undeclared (first use in this function)
Registry.c:1069: error: expected ';' before 'uIndex'
Registry.c:1071: error: expected ';' before 'ilNameSize'
Registry.c:1074: error: 'hKey' undeclared (first use in this function)
Registry.c:1074: error: expected ':' before numeric constant
Registry.c:1077: error: 'uIndex' undeclared (first use in this function)
Registry.c:1077: error: expected ':' before numeric constant
Registry.xs:362: error: 'ilNameSize' undeclared (first use in this function)
Registry.c: In function 'XS_Win32API__Registry__RegEnumKeyW':
Registry.c:1109: error: 'HKEY' undeclared (first use in this function)
Registry.c:1109: error: expected ';' before 'hKey'
Registry.c:1110: error: 'DWORD' undeclared (first use in this function)
Registry.c:1110: error: expected ';' before 'uIndex'
Registry.c:1111: error: 'WCHAR' undeclared (first use in this function)
Registry.c:1111: error: 'oswName' undeclared (first use in this function)
Registry.c:1112: error: expected ';' before 'ilwNameSize'
Registry.c:1115: error: 'hKey' undeclared (first use in this function)
Registry.c:1115: error: expected ':' before numeric constant
Registry.c:1118: error: 'uIndex' undeclared (first use in this function)
Registry.c:1118: error: expected ':' before numeric constant
Registry.xs:376: error: expected expression before ')' token
Registry.xs:376: error: 'ilwNameSize' undeclared (first use in this function)
Registry.c: In function 'XS_Win32API__Registry__RegEnumKeyExA':
Registry.c:1150: error: 'HKEY' undeclared (first use in this function)
Registry.c:1150: error: expected ';' before 'hKey'
Registry.c:1151: error: 'DWORD' undeclared (first use in this function)
Registry.c:1151: error: expected ';' before 'uIndex'
Registry.c:1153: error: 'iolName' undeclared (first use in this function)
Registry.c:1154: error: 'pNull' undeclared (first use in this function)
Registry.c:1156: error: 'iolClass' undeclared (first use in this function)
Registry.c:1157: error: 'FILETIME' undeclared (first use in this function)
Registry.c:1157: error: 'opftLastWrite' undeclared (first use in this function)
Registry.xs:394: error: expected ';' before 'uErr'
Registry.c:1163: error: 'hKey' undeclared (first use in this function)
Registry.c:1163: error: expected ':' before numeric constant
Registry.c:1166: error: 'uIndex' undeclared (first use in this function)
Registry.c:1166: error: expected ':' before numeric constant
Registry.c:1172: error: expected expression before ')' token
Registry.c:1175: error: expected expression before ')' token
Registry.xs:396: error: expected expression before ')' token
Registry.xs:397: error: expected expression before ')' token
Registry.xs:398: error: expected expression before ')' token
Registry.xs:399: error: expected expression before ')' token
Registry.xs:400: error: 'uErr' undeclared (first use in this function)
Registry.xs:402: error: 'ERROR_MORE_DATA' undeclared (first use in this function)
Registry.xs:404: error: expected expression before ')' token
Registry.xs:405: error: expected expression before ')' token
Registry.c: In function 'XS_Win32API__Registry__RegEnumKeyExW':
Registry.c:1232: error: 'HKEY' undeclared (first use in this function)
Registry.c:1232: error: expected ';' before 'hKey'
Registry.c:1233: error: 'DWORD' undeclared (first use in this function)
Registry.c:1233: error: expected ';' before 'uIndex'
Registry.c:1234: error: 'WCHAR' undeclared (first use in this function)
Registry.c:1234: error: 'oswName' undeclared (first use in this function)
Registry.c:1235: error: 'iolwName' undeclared (first use in this function)
Registry.c:1236: error: 'pNull' undeclared (first use in this function)
Registry.c:1237: error: 'oswClass' undeclared (first use in this function)
Registry.c:1238: error: 'iolwClass' undeclared (first use in this function)
Registry.c:1239: error: 'FILETIME' undeclared (first use in this function)
Registry.c:1239: error: 'opftLastWrite' undeclared (first use in this function)
Registry.xs:431: error: expected ';' before 'uErr'
Registry.c:1245: error: 'hKey' undeclared (first use in this function)
Registry.c:1245: error: expected ':' before numeric constant
Registry.c:1248: error: 'uIndex' undeclared (first use in this function)
Registry.c:1248: error: expected ':' before numeric constant
Registry.c:1254: error: expected expression before ')' token
Registry.c:1257: error: expected expression before ')' token
Registry.xs:433: error: expected expression before ')' token
Registry.xs:434: error: expected expression before ')' token
Registry.xs:434: error: expected expression before ')' token
Registry.xs:435: error: expected expression before ')' token
Registry.xs:436: error: expected expression before ')' token
Registry.xs:436: error: expected expression before ')' token
Registry.xs:437: error: 'uErr' undeclared (first use in this function)
Registry.xs:439: error: 'ERROR_MORE_DATA' undeclared (first use in this function)
Registry.xs:441: error: expected expression before ')' token
Registry.xs:441: error: expected expression before ')' token
Registry.xs:442: error: expected expression before ')' token
Registry.xs:442: error: expected expression before ')' token
Registry.c: In function 'XS_Win32API__Registry__RegEnumValueA':
Registry.c:1314: error: 'HKEY' undeclared (first use in this function)
Registry.c:1314: error: expected ';' before 'hKey'
Registry.c:1315: error: 'DWORD' undeclared (first use in this function)
Registry.c:1315: error: expected ';' before 'uIndex'
Registry.c:1317: error: 'iolName' undeclared (first use in this function)
Registry.c:1318: error: 'pNull' undeclared (first use in this function)
Registry.c:1319: error: 'ouType' undeclared (first use in this function)
Registry.c:1320: error: 'BYTE' undeclared (first use in this function)
Registry.c:1320: error: 'opData' undeclared (first use in this function)
Registry.c:1321: error: 'iolData' undeclared (first use in this function)
Registry.xs:468: error: expected ';' before 'uErr'
Registry.c:1327: error: 'hKey' undeclared (first use in this function)
Registry.c:1327: error: expected ':' before numeric constant
Registry.c:1330: error: 'uIndex' undeclared (first use in this function)
Registry.c:1330: error: expected ':' before numeric constant
Registry.c:1336: error: expected expression before ')' token
Registry.c:1342: error: expected expression before ')' token
Registry.xs:470: error: expected expression before ')' token
Registry.xs:471: error: expected expression before ')' token
Registry.xs:472: error: expected expression before ')' token
Registry.xs:473: error: expected expression before ')' token
Registry.xs:473: error: expected expression before ')' token
Registry.xs:475: error: expected expression before ')' token
Registry.xs:476: error: 'uErr' undeclared (first use in this function)
Registry.xs:478: error: 'ERROR_MORE_DATA' undeclared (first use in this function)
Registry.xs:480: error: expected expression before ')' token
Registry.xs:481: error: expected expression before ')' token
Registry.xs:481: error: expected expression before ')' token
Registry.xs:488: error: 'REG_SZ' undeclared (first use in this function)
Registry.xs:488: error: 'REG_EXPAND_SZ' undeclared (first use in this function)
Registry.c: In function 'XS_Win32API__Registry__RegEnumValueW':
Registry.c:1408: error: 'HKEY' undeclared (first use in this function)
Registry.c:1408: error: expected ';' before 'hKey'
Registry.c:1409: error: 'DWORD' undeclared (first use in this function)
Registry.c:1409: error: expected ';' before 'uIndex'
Registry.c:1410: error: 'WCHAR' undeclared (first use in this function)
Registry.c:1410: error: 'oswName' undeclared (first use in this function)
Registry.c:1411: error: 'iolwName' undeclared (first use in this function)
Registry.c:1412: error: 'pNull' undeclared (first use in this function)
Registry.c:1413: error: 'ouType' undeclared (first use in this function)
Registry.c:1414: error: 'BYTE' undeclared (first use in this function)
Registry.c:1414: error: 'opData' undeclared (first use in this function)
Registry.c:1415: error: 'iolData' undeclared (first use in this function)
Registry.xs:512: error: expected ';' before 'uErr'
Registry.c:1421: error: 'hKey' undeclared (first use in this function)
Registry.c:1421: error: expected ':' before numeric constant
Registry.c:1424: error: 'uIndex' undeclared (first use in this function)
Registry.c:1424: error: expected ':' before numeric constant
Registry.c:1430: error: expected expression before ')' token
Registry.c:1436: error: expected expression before ')' token
Registry.xs:514: error: expected expression before ')' token
Registry.xs:515: error: expected expression before ')' token
Registry.xs:515: error: expected expression before ')' token
Registry.xs:516: error: expected expression before ')' token
Registry.xs:517: error: expected expression before ')' token
Registry.xs:517: error: expected expression before ')' token
Registry.xs:519: error: expected expression before ')' token
Registry.xs:520: error: 'uErr' undeclared (first use in this function)
Registry.xs:522: error: 'ERROR_MORE_DATA' undeclared (first use in this function)
Registry.xs:524: error: expected expression before ')' token
Registry.xs:524: error: expected expression before ')' token
Registry.xs:525: error: expected expression before ')' token
Registry.xs:525: error: expected expression before ')' token
Registry.xs:532: error: 'REG_SZ' undeclared (first use in this function)
Registry.xs:532: error: 'REG_EXPAND_SZ' undeclared (first use in this function)
Registry.xs:534: error: expected expression before ')' token
Registry.c: In function 'XS_Win32API__Registry_RegFlushKey':
Registry.c:1503: error: 'HKEY' undeclared (first use in this function)
Registry.c:1503: error: expected ';' before 'hKey'
Registry.c:1506: error: 'hKey' undeclared (first use in this function)
Registry.c:1506: error: expected ':' before numeric constant
Registry.c: In function 'XS_Win32API__Registry__RegGetKeySecurity':
Registry.c:1535: error: 'HKEY' undeclared (first use in this function)
Registry.c:1535: error: expected ';' before 'hKey'
Registry.c:1536: error: 'SECURITY_INFORMATION' undeclared (first use in this function)
Registry.c:1536: error: expected ';' before 'uSecInfo'
Registry.c:1537: error: 'SECURITY_DESCRIPTOR' undeclared (first use in this function)
Registry.c:1537: error: 'opSecDesc' undeclared (first use in this function)
Registry.c:1538: error: 'DWORD' undeclared (first use in this function)
Registry.c:1538: error: 'iolSecDesc' undeclared (first use in this function)
Registry.xs:562: error: expected ';' before 'uErr'
Registry.c:1544: error: 'hKey' undeclared (first use in this function)
Registry.c:1544: error: expected ':' before numeric constant
Registry.c:1547: error: 'uSecInfo' undeclared (first use in this function)
Registry.c:1547: error: expected ':' before numeric constant
Registry.xs:564: error: expected expression before ')' token
Registry.xs:565: error: expected expression before ')' token
Registry.xs:565: error: expected expression before ')' token
Registry.xs:567: error: 'uErr' undeclared (first use in this function)
Registry.xs:568: error: 'ERROR_INSUFFICIENT_BUFFER' undeclared (first use in this function)
Registry.xs:569: error: expected expression before ')' token
Registry.xs:569: error: expected expression before ')' token
Registry.c: In function 'XS_Win32API__Registry_RegLoadKeyA':
Registry.c:1592: error: 'HKEY' undeclared (first use in this function)
Registry.c:1592: error: expected ';' before 'hKey'
Registry.c:1597: error: 'hKey' undeclared (first use in this function)
Registry.c:1597: error: expected ':' before numeric constant
Registry.c: In function 'XS_Win32API__Registry_RegLoadKeyW':
Registry.c:1640: error: 'HKEY' undeclared (first use in this function)
Registry.c:1640: error: expected ';' before 'hKey'
Registry.c:1641: error: 'WCHAR' undeclared (first use in this function)
Registry.c:1641: error: 'swSubKey' undeclared (first use in this function)
Registry.c:1642: error: 'swFileName' undeclared (first use in this function)
Registry.c:1645: error: 'hKey' undeclared (first use in this function)
Registry.c:1645: error: expected ':' before numeric constant
Registry.c:1650: error: expected expression before ')' token
Registry.c:1657: error: expected expression before ')' token
Registry.c: In function 'XS_Win32API__Registry_RegNotifyChangeKeyValue':
Registry.c:1688: error: 'HKEY' undeclared (first use in this function)
Registry.c:1688: error: expected ';' before 'hKey'
Registry.c:1689: error: 'BOOL' undeclared (first use in this function)
Registry.c:1689: error: expected ';' before 'bWatchSubtree'
Registry.c:1690: error: 'DWORD' undeclared (first use in this function)
Registry.c:1690: error: expected ';' before 'uNotifyFilter'
Registry.c:1691: error: 'HANDLE' undeclared (first use in this function)
Registry.c:1691: error: expected ';' before 'hEvent'
Registry.c:1692: error: expected ';' before 'bAsync'
Registry.c:1695: error: 'hKey' undeclared (first use in this function)
Registry.c:1695: error: expected ':' before numeric constant
Registry.c:1698: error: 'bWatchSubtree' undeclared (first use in this function)
Registry.c:1698: error: expected ':' before numeric constant
Registry.c:1701: error: 'uNotifyFilter' undeclared (first use in this function)
Registry.c:1701: error: expected ':' before numeric constant
Registry.c:1704: error: 'hEvent' undeclared (first use in this function)
Registry.c:1704: error: expected ':' before numeric constant
Registry.c:1707: error: 'bAsync' undeclared (first use in this function)
Registry.c:1707: error: expected ':' before numeric constant
Registry.c: In function 'XS_Win32API__Registry_RegOpenKeyA':
Registry.c:1737: error: 'HKEY' undeclared (first use in this function)
Registry.c:1737: error: expected ';' before 'hKey'
Registry.c:1739: error: 'ohSubKey' undeclared (first use in this function)
Registry.c:1742: error: 'hKey' undeclared (first use in this function)
Registry.c:1742: error: expected ':' before numeric constant
Registry.c:1755: error: expected expression before ')' token
Registry.c: In function 'XS_Win32API__Registry_RegOpenKeyW':
Registry.c:1788: error: 'HKEY' undeclared (first use in this function)
Registry.c:1788: error: expected ';' before 'hKey'
Registry.c:1789: error: 'WCHAR' undeclared (first use in this function)
Registry.c:1789: error: 'swSubKey' undeclared (first use in this function)
Registry.c:1790: error: 'ohSubKey' undeclared (first use in this function)
Registry.c:1793: error: 'hKey' undeclared (first use in this function)
Registry.c:1793: error: expected ':' before numeric constant
Registry.c:1798: error: expected expression before ')' token
Registry.c:1806: error: expected expression before ')' token
Registry.c: In function 'XS_Win32API__Registry_RegOpenKeyExA':
Registry.c:1839: error: 'HKEY' undeclared (first use in this function)
Registry.c:1839: error: expected ';' before 'hKey'
Registry.c:1841: error: 'DWORD' undeclared (first use in this function)
Registry.c:1841: error: expected ';' before 'uOptions'
Registry.c:1842: error: 'REGSAM' undeclared (first use in this function)
Registry.c:1842: error: expected ';' before 'uAccess'
Registry.c:1843: error: 'ohSubKey' undeclared (first use in this function)
Registry.c:1846: error: 'hKey' undeclared (first use in this function)
Registry.c:1846: error: expected ':' before numeric constant
Registry.c:1856: error: 'uOptions' undeclared (first use in this function)
Registry.c:1856: error: expected ':' before numeric constant
Registry.c:1859: error: 'uAccess' undeclared (first use in this function)
Registry.c:1859: error: expected ':' before numeric constant
Registry.c:1865: error: expected expression before ')' token
Registry.c: In function 'XS_Win32API__Registry_RegOpenKeyExW':
Registry.c:1899: error: 'HKEY' undeclared (first use in this function)
Registry.c:1899: error: expected ';' before 'hKey'
Registry.c:1900: error: 'WCHAR' undeclared (first use in this function)
Registry.c:1900: error: 'swSubKey' undeclared (first use in this function)
Registry.c:1901: error: 'DWORD' undeclared (first use in this function)
Registry.c:1901: error: expected ';' before 'uOptions'
Registry.c:1902: error: 'REGSAM' undeclared (first use in this function)
Registry.c:1902: error: expected ';' before 'uAccess'
Registry.c:1903: error: 'ohSubKey' undeclared (first use in this function)
Registry.c:1906: error: 'hKey' undeclared (first use in this function)
Registry.c:1906: error: expected ':' before numeric constant
Registry.c:1911: error: expected expression before ')' token
Registry.c:1916: error: 'uOptions' undeclared (first use in this function)
Registry.c:1916: error: expected ':' before numeric constant
Registry.c:1919: error: 'uAccess' undeclared (first use in this function)
Registry.c:1919: error: expected ':' before numeric constant
Registry.c:1925: error: expected expression before ')' token
Registry.c: In function 'XS_Win32API__Registry__RegQueryInfoKeyA':
Registry.c:1959: error: 'HKEY' undeclared (first use in this function)
Registry.c:1959: error: expected ';' before 'hKey'
Registry.c:1961: error: 'DWORD' undeclared (first use in this function)
Registry.c:1961: error: 'iolClass' undeclared (first use in this function)
Registry.c:1962: error: 'pNull' undeclared (first use in this function)
Registry.c:1963: error: 'ocSubKeys' undeclared (first use in this function)
Registry.c:1964: error: 'olSubKey' undeclared (first use in this function)
Registry.c:1965: error: 'olSubClass' undeclared (first use in this function)
Registry.c:1966: error: 'ocValues' undeclared (first use in this function)
Registry.c:1967: error: 'olValName' undeclared (first use in this function)
Registry.c:1968: error: 'olValData' undeclared (first use in this function)
Registry.c:1969: error: 'olSecDesc' undeclared (first use in this function)
Registry.c:1970: error: 'FILETIME' undeclared (first use in this function)
Registry.c:1970: error: 'opftTime' undeclared (first use in this function)
Registry.xs:687: error: expected ';' before 'uErr'
Registry.c:1976: error: 'hKey' undeclared (first use in this function)
Registry.c:1976: error: expected ':' before numeric constant
Registry.c:1982: error: expected expression before ')' token
Registry.c:1988: error: expected expression before ')' token
Registry.c:1995: error: expected expression before ')' token
Registry.c:2002: error: expected expression before ')' token
Registry.c:2009: error: expected expression before ')' token
Registry.c:2016: error: expected expression before ')' token
Registry.c:2023: error: expected expression before ')' token
Registry.c:2030: error: expected expression before ')' token
Registry.c:2034: error: expected expression before ')' token
Registry.xs:689: error: expected expression before ')' token
Registry.xs:690: error: expected expression before ')' token
Registry.xs:691: error: 'uErr' undeclared (first use in this function)
Registry.xs:694: error: 'ERROR_MORE_DATA' undeclared (first use in this function)
Registry.xs:695: error: expected expression before ')' token
Registry.c: In function 'XS_Win32API__Registry__RegQueryInfoKeyW':
Registry.c:2105: error: 'HKEY' undeclared (first use in this function)
Registry.c:2105: error: expected ';' before 'hKey'
Registry.c:2106: error: 'WCHAR' undeclared (first use in this function)
Registry.c:2106: error: 'oswClass' undeclared (first use in this function)
Registry.c:2107: error: 'DWORD' undeclared (first use in this function)
Registry.c:2107: error: 'iolwClass' undeclared (first use in this function)
Registry.c:2108: error: 'pNull' undeclared (first use in this function)
Registry.c:2109: error: 'ocSubKeys' undeclared (first use in this function)
Registry.c:2110: error: 'olwSubKey' undeclared (first use in this function)
Registry.c:2111: error: 'olwSubClass' undeclared (first use in this function)
Registry.c:2112: error: 'ocValues' undeclared (first use in this function)
Registry.c:2113: error: 'olwValName' undeclared (first use in this function)
Registry.c:2114: error: 'olValData' undeclared (first use in this function)
Registry.c:2115: error: 'olSecDesc' undeclared (first use in this function)
Registry.c:2116: error: 'FILETIME' undeclared (first use in this function)
Registry.c:2116: error: 'opftTime' undeclared (first use in this function)
Registry.xs:731: error: expected ';' before 'uErr'
Registry.c:2122: error: 'hKey' undeclared (first use in this function)
Registry.c:2122: error: expected ':' before numeric constant
Registry.c:2128: error: expected expression before ')' token
Registry.c:2134: error: expected expression before ')' token
Registry.c:2141: error: expected expression before ')' token
Registry.c:2148: error: expected expression before ')' token
Registry.c:2155: error: expected expression before ')' token
Registry.c:2162: error: expected expression before ')' token
Registry.c:2169: error: expected expression before ')' token
Registry.c:2176: error: expected expression before ')' token
Registry.c:2180: error: expected expression before ')' token
Registry.xs:733: error: expected expression before ')' token
Registry.xs:734: error: expected expression before ')' token
Registry.xs:734: error: expected expression before ')' token
Registry.xs:735: error: 'uErr' undeclared (first use in this function)
Registry.xs:738: error: 'ERROR_MORE_DATA' undeclared (first use in this function)
Registry.xs:739: error: expected expression before ')' token
Registry.xs:739: error: expected expression before ')' token
Registry.c: In function 'XS_Win32API__Registry__RegQueryMultipleValuesA':
Registry.c:2251: error: 'HKEY' undeclared (first use in this function)
Registry.c:2251: error: expected ';' before 'hKey'
Registry.c:2252: error: 'VALENT' undeclared (first use in this function)
Registry.c:2252: error: 'ioarValueEnts' undeclared (first use in this function)
Registry.c:2253: error: 'DWORD' undeclared (first use in this function)
Registry.c:2253: error: expected ';' before 'icValueEnts'
Registry.c:2255: error: 'iolBuffer' undeclared (first use in this function)
Registry.xs:767: error: expected ';' before 'uErr'
Registry.c:2261: error: 'hKey' undeclared (first use in this function)
Registry.c:2261: error: expected ':' before numeric constant
Registry.c:2266: error: expected expression before ')' token
Registry.c:2271: error: 'icValueEnts' undeclared (first use in this function)
Registry.c:2271: error: expected ':' before numeric constant
Registry.xs:777: warning: format '%d' expects type 'int', but argument 4 has type 'STRLEN'
Registry.xs:780: error: expected expression before ')' token
Registry.xs:781: error: expected expression before ')' token
Registry.xs:782: error: 'uErr' undeclared (first use in this function)
Registry.xs:784: error: 'ERROR_MORE_DATA' undeclared (first use in this function)
Registry.xs:785: error: expected expression before ')' token
Registry.c: In function 'XS_Win32API__Registry__RegQueryMultipleValuesW':
Registry.c:2325: error: 'HKEY' undeclared (first use in this function)
Registry.c:2325: error: expected ';' before 'hKey'
Registry.c:2326: error: 'VALENTW' undeclared (first use in this function)
Registry.c:2326: error: 'ioarValueEnts' undeclared (first use in this function)
Registry.c:2327: error: 'DWORD' undeclared (first use in this function)
Registry.c:2327: error: expected ';' before 'icValueEnts'
Registry.c:2328: error: 'WCHAR' undeclared (first use in this function)
Registry.c:2328: error: 'opBuffer' undeclared (first use in this function)
Registry.c:2329: error: 'iolBuffer' undeclared (first use in this function)
Registry.xs:804: error: expected ';' before 'uErr'
Registry.c:2335: error: 'hKey' undeclared (first use in this function)
Registry.c:2335: error: expected ':' before numeric constant
Registry.c:2340: error: expected expression before ')' token
Registry.c:2345: error: 'icValueEnts' undeclared (first use in this function)
Registry.c:2345: error: expected ':' before numeric constant
Registry.xs:814: warning: format '%d' expects type 'int', but argument 4 has type 'STRLEN'
Registry.xs:817: error: expected expression before ')' token
Registry.xs:818: error: expected expression before ')' token
Registry.xs:818: error: expected expression before ')' token
Registry.xs:819: error: 'uErr' undeclared (first use in this function)
Registry.xs:821: error: 'ERROR_MORE_DATA' undeclared (first use in this function)
Registry.xs:822: error: expected expression before ')' token
Registry.xs:822: error: expected expression before ')' token
Registry.c: In function 'XS_Win32API__Registry__RegQueryValueA':
Registry.c:2399: error: 'HKEY' undeclared (first use in this function)
Registry.c:2399: error: expected ';' before 'hKey'
Registry.c:2402: error: 'LONG' undeclared (first use in this function)
Registry.c:2402: error: 'iolValueData' undeclared (first use in this function)
Registry.xs:840: error: 'DWORD' undeclared (first use in this function)
Registry.xs:840: error: expected ';' before 'uErr'
Registry.c:2408: error: 'hKey' undeclared (first use in this function)
Registry.c:2408: error: expected ':' before numeric constant
Registry.xs:842: error: expected expression before ')' token
Registry.xs:843: error: expected expression before ')' token
Registry.xs:844: error: 'uErr' undeclared (first use in this function)
Registry.xs:845: error: 'ERROR_MORE_DATA' undeclared (first use in this function)
Registry.xs:846: error: expected expression before ')' token
Registry.c: In function 'XS_Win32API__Registry__RegQueryValueW':
Registry.c:2456: error: 'HKEY' undeclared (first use in this function)
Registry.c:2456: error: expected ';' before 'hKey'
Registry.c:2457: error: 'WCHAR' undeclared (first use in this function)
Registry.c:2457: error: 'swSubKey' undeclared (first use in this function)
Registry.c:2458: error: 'oswValueData' undeclared (first use in this function)
Registry.c:2459: error: 'LONG' undeclared (first use in this function)
Registry.c:2459: error: 'iolValueData' undeclared (first use in this function)
Registry.xs:863: error: 'DWORD' undeclared (first use in this function)
Registry.xs:863: error: expected ';' before 'uErr'
Registry.c:2465: error: 'hKey' undeclared (first use in this function)
Registry.c:2465: error: expected ':' before numeric constant
Registry.c:2470: error: expected expression before ')' token
Registry.xs:865: error: expected expression before ')' token
Registry.xs:866: error: expected expression before ')' token
Registry.xs:866: error: expected expression before ')' token
Registry.xs:867: error: 'uErr' undeclared (first use in this function)
Registry.xs:868: error: 'ERROR_MORE_DATA' undeclared (first use in this function)
Registry.xs:869: error: expected expression before ')' token
Registry.xs:869: error: expected expression before ')' token
Registry.c: In function 'XS_Win32API__Registry__RegQueryValueExA':
Registry.c:2514: error: 'HKEY' undeclared (first use in this function)
Registry.c:2514: error: expected ';' before 'hKey'
Registry.c:2516: error: 'DWORD' undeclared (first use in this function)
Registry.c:2516: error: 'pNull' undeclared (first use in this function)
Registry.c:2517: error: 'ouType' undeclared (first use in this function)
Registry.c:2518: error: 'BYTE' undeclared (first use in this function)
Registry.c:2518: error: 'opData' undeclared (first use in this function)
Registry.c:2519: error: 'iolData' undeclared (first use in this function)
Registry.xs:889: error: expected ';' before 'uErr'
Registry.c:2525: error: 'hKey' undeclared (first use in this function)
Registry.c:2525: error: expected ':' before numeric constant
Registry.c:2538: error: expected expression before ')' token
Registry.c:2544: error: expected expression before ')' token
Registry.xs:892: error: expected expression before ')' token
Registry.xs:893: error: expected expression before ')' token
Registry.xs:894: error: expected expression before ')' token
Registry.xs:894: error: expected expression before ')' token
Registry.xs:895: error: 'uErr' undeclared (first use in this function)
Registry.xs:897: error: 'ERROR_MORE_DATA' undeclared (first use in this function)
Registry.xs:898: error: expected expression before ')' token
Registry.xs:898: error: expected expression before ')' token
Registry.xs:905: error: 'REG_SZ' undeclared (first use in this function)
Registry.xs:905: error: 'REG_EXPAND_SZ' undeclared (first use in this function)
Registry.c: In function 'XS_Win32API__Registry__RegQueryValueExW':
Registry.c:2601: error: 'HKEY' undeclared (first use in this function)
Registry.c:2601: error: expected ';' before 'hKey'
Registry.c:2602: error: 'WCHAR' undeclared (first use in this function)
Registry.c:2602: error: 'swName' undeclared (first use in this function)
Registry.c:2603: error: 'DWORD' undeclared (first use in this function)
Registry.c:2603: error: 'pNull' undeclared (first use in this function)
Registry.c:2604: error: 'ouType' undeclared (first use in this function)
Registry.c:2605: error: 'BYTE' undeclared (first use in this function)
Registry.c:2605: error: 'opData' undeclared (first use in this function)
Registry.c:2606: error: 'iolData' undeclared (first use in this function)
Registry.xs:925: error: expected ';' before 'uErr'
Registry.c:2612: error: 'hKey' undeclared (first use in this function)
Registry.c:2612: error: expected ':' before numeric constant
Registry.c:2617: error: expected expression before ')' token
Registry.c:2625: error: expected expression before ')' token
Registry.c:2631: error: expected expression before ')' token
Registry.xs:928: error: expected expression before ')' token
Registry.xs:929: error: expected expression before ')' token
Registry.xs:930: error: expected expression before ')' token
Registry.xs:930: error: expected expression before ')' token
Registry.xs:931: error: 'uErr' undeclared (first use in this function)
Registry.xs:933: error: 'ERROR_MORE_DATA' undeclared (first use in this function)
Registry.xs:934: error: expected expression before ')' token
Registry.xs:934: error: expected expression before ')' token
Registry.xs:941: error: 'REG_SZ' undeclared (first use in this function)
Registry.xs:941: error: 'REG_EXPAND_SZ' undeclared (first use in this function)
Registry.xs:943: error: expected expression before ')' token
Registry.c: In function 'XS_Win32API__Registry_RegReplaceKeyA':
Registry.c:2689: error: 'HKEY' undeclared (first use in this function)
Registry.c:2689: error: expected ';' before 'hKey'
Registry.c:2695: error: 'hKey' undeclared (first use in this function)
Registry.c:2695: error: expected ':' before numeric constant
Registry.c: In function 'XS_Win32API__Registry_RegReplaceKeyW':
Registry.c:2746: error: 'HKEY' undeclared (first use in this function)
Registry.c:2746: error: expected ';' before 'hKey'
Registry.c:2747: error: 'WCHAR' undeclared (first use in this function)
Registry.c:2747: error: 'swSubKey' undeclared (first use in this function)
Registry.c:2748: error: 'swNewFile' undeclared (first use in this function)
Registry.c:2749: error: 'swOldFile' undeclared (first use in this function)
Registry.c:2752: error: 'hKey' undeclared (first use in this function)
Registry.c:2752: error: expected ':' before numeric constant
Registry.c:2757: error: expected expression before ')' token
Registry.c:2764: error: expected expression before ')' token
Registry.c:2771: error: expected expression before ')' token
Registry.c: In function 'XS_Win32API__Registry_RegRestoreKeyA':
Registry.c:2803: error: 'HKEY' undeclared (first use in this function)
Registry.c:2803: error: expected ';' before 'hKey'
Registry.c:2805: error: 'DWORD' undeclared (first use in this function)
Registry.c:2805: error: expected ';' before 'uFlags'
Registry.c:2808: error: 'hKey' undeclared (first use in this function)
Registry.c:2808: error: expected ':' before numeric constant
Registry.c:2818: error: 'uFlags' undeclared (first use in this function)
Registry.c:2818: error: expected ':' before numeric constant
Registry.c: In function 'XS_Win32API__Registry_RegRestoreKeyW':
Registry.c:2847: error: 'HKEY' undeclared (first use in this function)
Registry.c:2847: error: expected ';' before 'hKey'
Registry.c:2848: error: 'WCHAR' undeclared (first use in this function)
Registry.c:2848: error: 'swFileName' undeclared (first use in this function)
Registry.c:2849: error: 'DWORD' undeclared (first use in this function)
Registry.c:2849: error: expected ';' before 'uFlags'
Registry.c:2852: error: 'hKey' undeclared (first use in this function)
Registry.c:2852: error: expected ':' before numeric constant
Registry.c:2857: error: expected expression before ')' token
Registry.c:2862: error: 'uFlags' undeclared (first use in this function)
Registry.c:2862: error: expected ':' before numeric constant
Registry.c: In function 'XS_Win32API__Registry_RegSaveKeyA':
Registry.c:2891: error: 'HKEY' undeclared (first use in this function)
Registry.c:2891: error: expected ';' before 'hKey'
Registry.c:2893: error: 'SECURITY_ATTRIBUTES' undeclared (first use in this function)
Registry.c:2893: error: 'pSecAttr' undeclared (first use in this function)
Registry.c:2896: error: 'hKey' undeclared (first use in this function)
Registry.c:2896: error: expected ':' before numeric constant
Registry.c:2908: error: expected expression before ')' token
Registry.c: In function 'XS_Win32API__Registry_RegSaveKeyW':
Registry.c:2939: error: 'HKEY' undeclared (first use in this function)
Registry.c:2939: error: expected ';' before 'hKey'
Registry.c:2940: error: 'WCHAR' undeclared (first use in this function)
Registry.c:2940: error: 'swFileName' undeclared (first use in this function)
Registry.c:2941: error: 'SECURITY_ATTRIBUTES' undeclared (first use in this function)
Registry.c:2941: error: 'pSecAttr' undeclared (first use in this function)
Registry.c:2944: error: 'hKey' undeclared (first use in this function)
Registry.c:2944: error: expected ':' before numeric constant
Registry.c:2949: error: expected expression before ')' token
Registry.c:2956: error: expected expression before ')' token
Registry.c: In function 'XS_Win32API__Registry_RegSetKeySecurity':
Registry.c:2987: error: 'HKEY' undeclared (first use in this function)
Registry.c:2987: error: expected ';' before 'hKey'
Registry.c:2988: error: 'SECURITY_INFORMATION' undeclared (first use in this function)
Registry.c:2988: error: expected ';' before 'uSecInfo'
Registry.c:2989: error: 'SECURITY_DESCRIPTOR' undeclared (first use in this function)
Registry.c:2989: error: 'pSecDesc' undeclared (first use in this function)
Registry.c:2992: error: 'hKey' undeclared (first use in this function)
Registry.c:2992: error: expected ':' before numeric constant
Registry.c:2995: error: 'uSecInfo' undeclared (first use in this function)
Registry.c:2995: error: expected ':' before numeric constant
Registry.c:3000: error: expected expression before ')' token
Registry.c: In function 'XS_Win32API__Registry__RegSetValueA':
Registry.c:3031: error: 'HKEY' undeclared (first use in this function)
Registry.c:3031: error: expected ';' before 'hKey'
Registry.c:3033: error: 'DWORD' undeclared (first use in this function)
Registry.c:3033: error: expected ';' before 'uType'
Registry.c:3035: error: expected ';' before 'lValueData'
Registry.c:3038: error: 'hKey' undeclared (first use in this function)
Registry.c:3038: error: expected ':' before numeric constant
Registry.c:3048: error: 'uType' undeclared (first use in this function)
Registry.c:3048: error: expected ':' before numeric constant
Registry.c:3058: error: 'lValueData' undeclared (first use in this function)
Registry.c:3058: error: expected ':' before numeric constant
Registry.c: In function 'XS_Win32API__Registry__RegSetValueW':
Registry.c:3090: error: 'HKEY' undeclared (first use in this function)
Registry.c:3090: error: expected ';' before 'hKey'
Registry.c:3091: error: 'WCHAR' undeclared (first use in this function)
Registry.c:3091: error: 'swSubKey' undeclared (first use in this function)
Registry.c:3092: error: 'DWORD' undeclared (first use in this function)
Registry.c:3092: error: expected ';' before 'uType'
Registry.c:3093: error: 'swValueData' undeclared (first use in this function)
Registry.c:3094: error: expected ';' before 'lValueData'
Registry.c:3097: error: 'hKey' undeclared (first use in this function)
Registry.c:3097: error: expected ':' before numeric constant
Registry.c:3102: error: expected expression before ')' token
Registry.c:3107: error: 'uType' undeclared (first use in this function)
Registry.c:3107: error: expected ':' before numeric constant
Registry.c:3112: error: expected expression before ')' token
Registry.c:3117: error: 'lValueData' undeclared (first use in this function)
Registry.c:3117: error: expected ':' before numeric constant
Registry.c: In function 'XS_Win32API__Registry__RegSetValueExA':
Registry.c:3149: error: 'HKEY' undeclared (first use in this function)
Registry.c:3149: error: expected ';' before 'hKey'
Registry.c:3151: error: 'DWORD' undeclared (first use in this function)
Registry.c:3151: error: expected ';' before 'uZero'
Registry.c:3152: error: expected ';' before 'uType'
Registry.c:3153: error: 'BYTE' undeclared (first use in this function)
Registry.c:3153: error: 'pData' undeclared (first use in this function)
Registry.c:3154: error: expected ';' before 'lData'
Registry.c:3157: error: 'hKey' undeclared (first use in this function)
Registry.c:3157: error: expected ':' before numeric constant
Registry.c:3167: error: 'uZero' undeclared (first use in this function)
Registry.c:3167: error: expected ':' before numeric constant
Registry.c:3170: error: 'uType' undeclared (first use in this function)
Registry.c:3170: error: expected ':' before numeric constant
Registry.c:3175: error: expected expression before ')' token
Registry.c:3180: error: 'lData' undeclared (first use in this function)
Registry.c:3180: error: expected ':' before numeric constant
Registry.xs:1077: error: 'REG_SZ' undeclared (first use in this function)
Registry.xs:1077: error: 'REG_EXPAND_SZ' undeclared (first use in this function)
Registry.c: In function 'XS_Win32API__Registry__RegSetValueExW':
Registry.c:3217: error: 'HKEY' undeclared (first use in this function)
Registry.c:3217: error: expected ';' before 'hKey'
Registry.c:3218: error: 'WCHAR' undeclared (first use in this function)
Registry.c:3218: error: 'swName' undeclared (first use in this function)
Registry.c:3219: error: 'DWORD' undeclared (first use in this function)
Registry.c:3219: error: expected ';' before 'uZero'
Registry.c:3220: error: expected ';' before 'uType'
Registry.c:3221: error: 'BYTE' undeclared (first use in this function)
Registry.c:3221: error: 'pData' undeclared (first use in this function)
Registry.c:3222: error: expected ';' before 'lData'
Registry.c:3225: error: 'hKey' undeclared (first use in this function)
Registry.c:3225: error: expected ':' before numeric constant
Registry.c:3230: error: expected expression before ')' token
Registry.c:3235: error: 'uZero' undeclared (first use in this function)
Registry.c:3235: error: expected ':' before numeric constant
Registry.c:3238: error: 'uType' undeclared (first use in this function)
Registry.c:3238: error: expected ':' before numeric constant
Registry.c:3243: error: expected expression before ')' token
Registry.c:3248: error: 'lData' undeclared (first use in this function)
Registry.c:3248: error: expected ':' before numeric constant
Registry.xs:1099: error: 'REG_SZ' undeclared (first use in this function)
Registry.xs:1099: error: 'REG_EXPAND_SZ' undeclared (first use in this function)
Registry.xs:1100: error: expected expression before ')' token
Registry.c: In function 'XS_Win32API__Registry_RegUnLoadKeyA':
Registry.c:3286: error: 'HKEY' undeclared (first use in this function)
Registry.c:3286: error: expected ';' before 'hKey'
Registry.c:3290: error: 'hKey' undeclared (first use in this function)
Registry.c:3290: error: expected ':' before numeric constant
Registry.c: In function 'XS_Win32API__Registry_RegUnLoadKeyW':
Registry.c:3326: error: 'HKEY' undeclared (first use in this function)
Registry.c:3326: error: expected ';' before 'hKey'
Registry.c:3327: error: 'WCHAR' undeclared (first use in this function)
Registry.c:3327: error: 'swSubKey' undeclared (first use in this function)
Registry.c:3330: error: 'hKey' undeclared (first use in this function)
Registry.c:3330: error: expected ':' before numeric constant
Registry.c:3335: error: expected expression before ')' token
lipo: can't open input file: /var/tmp//ccjgQXl0.out (No such file or directory)
make: *** [Registry.o] Error 1

------------------------------
PREREQUISITES
------------------------------

Prerequisite modules loaded:

build_requires:

    Module              Need Have
    ------------------- ---- ----
    ExtUtils::MakeMaker 0    6.59

configure_requires:

    Module              Need Have
    ------------------- ---- ----
    ExtUtils::MakeMaker 0    6.59


------------------------------
ENVIRONMENT AND OTHER CONTEXT
------------------------------

Environment variables:

    AUTOMATED_TESTING = 1
    PATH = /usr/bin:/bin
    PERL5LIB = /Users/nigel/perl/Library/Perl/Updates/5.12.3:/Users/nigel/perl/Users/nigel/perl::/Users/nigel/perl/lib/perl5:/Users/nigel/perl/lib/perl5/site_perl:
    PERL5OPT = 
    PERL5_CPANPLUS_IS_RUNNING = 53342
    PERL5_CPAN_IS_EXECUTING = /Users/nigel/.cpan/build/Win32API-Registry-0.32-Oz3fFE/Makefile.PL
    PERL5_CPAN_IS_RUNNING = 53342
    PERL5_MINISMOKEBOX = 0.54
    PERL_AUTOINSTALL = --defaultdeps
    PERL_EXTUTILS_AUTOINSTALL = --defaultdeps
    PERL_MM_USE_DEFAULT = 1
    SHELL = /bin/sh
    VERSIONER_PERL_PREFER_32_BIT = no
    VERSIONER_PERL_VERSION = 5.12

Perl special variables (and OS-specific diagnostics, for MSWin32):

    $^X = /usr/bin/perl5.12
    $UID/$EUID = 1077 / 1077
    $GID = 20 20 402 12 33 61 79 80 81 98 100 204 401 403
    $EGID = 20 20 402 12 33 61 79 80 81 98 100 204 401 403

Perl module toolchain versions installed:

    Module              Have    
    ------------------- --------
    CPAN                1.9800  
    CPAN::Meta          2.112620
    Cwd                 3.33    
    ExtUtils::CBuilder  0.27    
    ExtUtils::Command   1.17    
    ExtUtils::Install   1.54    
    ExtUtils::MakeMaker 6.59    
    ExtUtils::Manifest  1.60    
    ExtUtils::ParseXS   3.04    
    File::Spec          3.33    
    JSON                2.53    
    JSON::PP            2.27200 
    Module::Build       broken  
    Module::Signature   n/a     
    Parse::CPAN::Meta   1.4401  
    Test::Harness       3.23    
    Test::More          0.98    
    YAML                0.73    
    YAML::Syck          1.17    
    version             0.94    


--

Summary of my perl5 (revision 5 version 12 subversion 3) configuration:
   
  Platform:
    osname=darwin, osvers=11.0, archname=darwin-thread-multi-2level
    uname='darwin fifth.apple.com 11.0 darwin kernel version 11.0.0: sun may 29 13:02:55 pdt 2011; root:xnu-1699.22.44~4release_x86_64 x86_64 '
    config_args='-ds -e -Dprefix=/usr -Dccflags=-g  -pipe  -Dldflags= -Dman3ext=3pm -Duseithreads -Duseshrplib -Dinc_version_list=none -Dcc=llvm-gcc-4.2'
    hint=recommended, useposix=true, d_sigaction=define
    useithreads=define, usemultiplicity=define
    useperlio=define, d_sfio=undef, uselargefiles=define, usesocks=undef
    use64bitint=define, use64bitall=define, uselongdouble=undef
    usemymalloc=n, bincompat5005=undef
  Compiler:
    cc='llvm-gcc-4.2', ccflags ='-arch x86_64 -arch i386 -g -pipe -fno-common -DPERL_DARWIN -fno-strict-aliasing -fstack-protector -I/usr/local/include',
    optimize='-Os',
    cppflags='-g -pipe -fno-common -DPERL_DARWIN -fno-strict-aliasing -fstack-protector -I/usr/local/include'
    ccversion='', gccversion='4.2.1 (Based on Apple Inc. build 5658) (LLVM build 2335.15.00)', gccosandvers=''
    intsize=4, longsize=8, ptrsize=8, doublesize=8, byteorder=12345678
    d_longlong=define, longlongsize=8, d_longdbl=define, longdblsize=16
    ivtype='long', ivsize=8, nvtype='double', nvsize=8, Off_t='off_t', lseeksize=8
    alignbytes=8, prototype=define
  Linker and Libraries:
    ld='llvm-gcc-4.2 -mmacosx-version-min=10.7', ldflags ='-arch x86_64 -arch i386 -fstack-protector -L/usr/local/lib'
    libpth=/usr/local/lib /usr/lib
    libs=-ldbm -ldl -lm -lutil -lc
    perllibs=-ldl -lm -lutil -lc
    libc=, so=dylib, useshrplib=true, libperl=libperl.dylib
    gnulibc_version=''
  Dynamic Linking:
    dlsrc=dl_dlopen.xs, dlext=bundle, d_dlsymun=undef, ccdlflags=' '
    cccdlflags=' ', lddlflags='-arch x86_64 -arch i386 -bundle -undefined dynamic_lookup -L/usr/local/lib -fstack-protector'


Characteristics of this binary (from libperl): 
  Compile-time options: MULTIPLICITY PERL_DONT_CREATE_GVSV
                        PERL_IMPLICIT_CONTEXT PERL_MALLOC_WRAP USE_64_BIT_ALL
                        USE_64_BIT_INT USE_ITHREADS USE_LARGE_FILES
                        USE_PERLIO USE_PERL_ATOF USE_REENTRANT_API
  Locally applied patches:
	/Library/Perl/Updates/<version> comes before system perl directories
	installprivlib and installarchlib points to the Updates directory
  Built under darwin
  Compiled at Jun 13 2011 14:45:31
  %ENV:
    PERL5LIB="/Users/nigel/perl/Library/Perl/Updates/5.12.3:/Users/nigel/perl/Users/nigel/perl::/Users/nigel/perl/lib/perl5:/Users/nigel/perl/lib/perl5/site_perl:"
    PERL5OPT=""
    PERL5_CPANPLUS_IS_RUNNING="53342"
    PERL5_CPAN_IS_EXECUTING="/Users/nigel/.cpan/build/Win32API-Registry-0.32-Oz3fFE/Makefile.PL"
    PERL5_CPAN_IS_RUNNING="53342"
    PERL5_MINISMOKEBOX="0.54"
    PERL_AUTOINSTALL="--defaultdeps"
    PERL_EXTUTILS_AUTOINSTALL="--defaultdeps"
    PERL_MM_USE_DEFAULT="1"
  @INC:
    /Users/nigel/perl/Library/Perl/Updates/5.12.3/darwin-thread-multi-2level
    /Users/nigel/perl/Library/Perl/Updates/5.12.3
    /Users/nigel/perl/Users/nigel/perl
    /Users/nigel/perl/lib/perl5/darwin-thread-multi-2level
    /Users/nigel/perl/lib/perl5
    /Users/nigel/perl/lib/perl5/site_perl/5.12.3/darwin-thread-multi-2level
    /Users/nigel/perl/lib/perl5/site_perl/5.12.3
    /Users/nigel/perl/lib/perl5/site_perl
    /Library/Perl/5.12/darwin-thread-multi-2level
    /Library/Perl/5.12
    /Network/Library/Perl/5.12/darwin-thread-multi-2level
    /Network/Library/Perl/5.12
    /Library/Perl/Updates/5.12.3/darwin-thread-multi-2level
    /Library/Perl/Updates/5.12.3
    /System/Library/Perl/5.12/darwin-thread-multi-2level
    /System/Library/Perl/5.12
    /System/Library/Perl/Extras/5.12/darwin-thread-multi-2level
    /System/Library/Perl/Extras/5.12
    .