Back
From: metabase:user:0d96120c-29e2-11e5-b049-ede3035d37de
Subject: UNKNOWN Win32-Process-Suspend-0.0642 v5.22.0 GNU/Linux
Date: 2015-07-24T17:03:27Z
This distribution has been tested as part of the CPAN Testers
project, supporting the Perl programming language. See
http://wiki.cpantesters.org/ for more information or email
questions to cpan-testers-discuss@perl.org
--
Dear Baggio, Kwok Lok Chung,
This is a computer-generated report for Win32-Process-Suspend-0.0642
on perl 5.22.0, created by CPAN-Reporter-1.2014.
Thank you for uploading your work to CPAN. However, attempting to
test your distribution gave an inconclusive result.
This could be because your distribution had an error during the make/build
stage, did not define tests, tests could not be found, because your tests were
interrupted before they finished, or because the results of the tests could not
be parsed. You may wish to consult the CPAN Testers Wiki:
http://wiki.cpantesters.org/wiki/CPANAuthorNotes
Sections of this report:
* Tester comments
* Program output
* Prerequisites
* Environment and other context
------------------------------
TESTER COMMENTS
------------------------------
Additional comments from tester:
this report is from an automated smoke testing program
and was not reviewed by a human for accuracy
------------------------------
PROGRAM OUTPUT
------------------------------
Output from '/usr/bin/make':
cp demo.pl blib/lib/Win32/Process/demo.pl
cp lib/Win32/Process/Suspend.pm blib/lib/Win32/Process/Suspend.pm
Running Mkbootstrap for Win32::Process::Suspend ()
chmod 644 "Suspend.bs"
"/data/perl5/perlbrew/perls/perl-5.22.0/bin/perl" "/home/perltest/perl5/perlbrew/perls/perl-5.22.0/lib/5.22.0/ExtUtils/xsubpp" -typemap "/home/perltest/perl5/perlbrew/perls/perl-5.22.0/lib/5.22.0/ExtUtils/typemap" Suspend.xs > Suspend.xsc && mv Suspend.xsc Suspend.c
Please specify prototyping behavior for Suspend.xs (see perlxs manual)
cc -c -I. -fwrapv -fno-strict-aliasing -pipe -fstack-protector-strong -I/usr/local/include -D_LARGEFILE_SOURCE -D_FILE_OFFSET_BITS=64 -O0 -DVERSION=\"0.0642\" -DXS_VERSION=\"0.0642\" -fPIC "-I/home/perltest/perl5/perlbrew/perls/perl-5.22.0/lib/5.22.0/x86_64-linux/CORE" Suspend.c
Suspend.xs:5:15: error: expected declaration specifiers or â...â before â*â token
typedef DWORD(*NTSUSPENDPROCESS)(HANDLE);
^
Suspend.xs:6:15: error: expected declaration specifiers or â...â before â*â token
typedef DWORD(*NTRESUMEPROCESS)(HANDLE);
^
Suspend.xs:7:15: error: expected declaration specifiers or â...â before â*â token
typedef DWORD(*NTSUSPENDTHREAD)(HANDLE);
^
Suspend.xs:8:15: error: expected declaration specifiers or â...â before â*â token
typedef DWORD(*NTRESUMETHREAD)(HANDLE);
^
Suspend.xs:9:41: error: unknown type name âBOOLâ
typedef void (*pRtlAdjustPrivilege)(int,BOOL,BOOL,int*);
^
Suspend.xs:9:46: error: unknown type name âBOOLâ
typedef void (*pRtlAdjustPrivilege)(int,BOOL,BOOL,int*);
^
Suspend.xs:10:1: error: unknown type name âNTSUSPENDPROCESSâ
NTSUSPENDPROCESS NtSuspendProcess = NULL;
^
Suspend.xs:11:1: error: unknown type name âNTRESUMEPROCESSâ
NTRESUMEPROCESS NtResumeProcess = NULL;
^
Suspend.xs:12:1: error: unknown type name âNTSUSPENDTHREADâ
NTSUSPENDTHREAD NtSuspendThread = NULL;
^
Suspend.xs:13:1: error: unknown type name âNTRESUMETHREADâ
NTRESUMETHREAD NtResumeThread = NULL;
^
Suspend.xs:14:1: error: unknown type name âpRtlAdjustPrivilegeâ
pRtlAdjustPrivilege RtlAdjPriv = NULL;
^
Suspend.xs: In function âXS_Win32__Process__Suspend_Importâ:
Suspend.xs:23:2: error: unknown type name âHMODULEâ
HMODULE ntdll = LoadLibrary("ntdll.dll");
^
Suspend.xs:24:22: error: âNTSUSPENDPROCESSâ undeclared (first use in this function)
NtSuspendProcess = (NTSUSPENDPROCESS)GetProcAddress(ntdll,"ZwSuspendProcess");
^
Suspend.xs:24:22: note: each undeclared identifier is reported only once for each function it appears in
Suspend.xs:24:39: error: expected â;â before âGetProcAddressâ
NtSuspendProcess = (NTSUSPENDPROCESS)GetProcAddress(ntdll,"ZwSuspendProcess");
^
Suspend.xs:25:21: error: âNTRESUMEPROCESSâ undeclared (first use in this function)
NtResumeProcess = (NTRESUMEPROCESS)GetProcAddress(ntdll,"ZwResumeProcess");
^
Suspend.xs:25:37: error: expected â;â before âGetProcAddressâ
NtResumeProcess = (NTRESUMEPROCESS)GetProcAddress(ntdll,"ZwResumeProcess");
^
Suspend.xs:26:21: error: âNTSUSPENDTHREADâ undeclared (first use in this function)
NtSuspendThread = (NTSUSPENDTHREAD)GetProcAddress(ntdll,"ZwSuspendThread");
^
Suspend.xs:26:37: error: expected â;â before âGetProcAddressâ
NtSuspendThread = (NTSUSPENDTHREAD)GetProcAddress(ntdll,"ZwSuspendThread");
^
Suspend.xs:27:20: error: âNTRESUMETHREADâ undeclared (first use in this function)
NtResumeThread = (NTRESUMETHREAD)GetProcAddress(ntdll,"ZwResumeThread");
^
Suspend.xs:27:35: error: expected â;â before âGetProcAddressâ
NtResumeThread = (NTRESUMETHREAD)GetProcAddress(ntdll,"ZwResumeThread");
^
Suspend.xs:28:16: error: âpRtlAdjustPrivilegeâ undeclared (first use in this function)
RtlAdjPriv = (pRtlAdjustPrivilege) GetProcAddress(ntdll,"RtlAdjustPrivilege");
^
Suspend.xs:28:37: error: expected â;â before âGetProcAddressâ
RtlAdjPriv = (pRtlAdjustPrivilege) GetProcAddress(ntdll,"RtlAdjustPrivilege");
^
Suspend.xs:32:3: error: called object âRtlAdjPrivâ is not a function or function pointer
RtlAdjPriv(20,TRUE,FALSE,&prtn);
^
Suspend.xs:14:21: note: declared here
pRtlAdjustPrivilege RtlAdjPriv = NULL;
^
Suspend.xs:34:13: warning: assignment makes integer from pointer without a cast
RtlAdjPriv = NULL;
^
Suspend.xs: In function âXS_Win32__Process__Suspend__SuspendProcessâ:
Suspend.xs:42:35: error: âHANDLEâ undeclared (first use in this function)
RETVAL = (long)NtSuspendProcess((HANDLE)hProc);
^
Suspend.xs:42:42: error: expected â)â before âhProcâ
RETVAL = (long)NtSuspendProcess((HANDLE)hProc);
^
Suspend.xs:42:17: error: called object âNtSuspendProcessâ is not a function or function pointer
RETVAL = (long)NtSuspendProcess((HANDLE)hProc);
^
Suspend.xs:10:18: note: declared here
NTSUSPENDPROCESS NtSuspendProcess = NULL;
^
Suspend.xs: In function âXS_Win32__Process__Suspend__ResumeProcessâ:
Suspend.xs:50:34: error: âHANDLEâ undeclared (first use in this function)
RETVAL = (long)NtResumeProcess((HANDLE)hProc);
^
Suspend.xs:50:41: error: expected â)â before âhProcâ
RETVAL = (long)NtResumeProcess((HANDLE)hProc);
^
Suspend.xs:50:17: error: called object âNtResumeProcessâ is not a function or function pointer
RETVAL = (long)NtResumeProcess((HANDLE)hProc);
^
Suspend.xs:11:17: note: declared here
NTRESUMEPROCESS NtResumeProcess = NULL;
^
Suspend.xs: In function âXS_Win32__Process__Suspend__SuspendThreadâ:
Suspend.xs:58:34: error: âHANDLEâ undeclared (first use in this function)
RETVAL = (long)NtSuspendThread((HANDLE)hThread);
^
Suspend.xs:58:41: error: expected â)â before âhThreadâ
RETVAL = (long)NtSuspendThread((HANDLE)hThread);
^
Suspend.xs:58:17: error: called object âNtSuspendThreadâ is not a function or function pointer
RETVAL = (long)NtSuspendThread((HANDLE)hThread);
^
Suspend.xs:12:17: note: declared here
NTSUSPENDTHREAD NtSuspendThread = NULL;
^
Suspend.xs: In function âXS_Win32__Process__Suspend__ResumeThreadâ:
Suspend.xs:66:33: error: âHANDLEâ undeclared (first use in this function)
RETVAL = (long)NtResumeThread((HANDLE)hThread);
^
Suspend.xs:66:40: error: expected â)â before âhThreadâ
RETVAL = (long)NtResumeThread((HANDLE)hThread);
^
Suspend.xs:66:17: error: called object âNtResumeThreadâ is not a function or function pointer
RETVAL = (long)NtResumeThread((HANDLE)hThread);
^
Suspend.xs:13:16: note: declared here
NTRESUMETHREAD NtResumeThread = NULL;
^
Suspend.xs: In function âXS_Win32__Process__Suspend__GetHandleâ:
Suspend.xs:75:29: error: âDWORDâ undeclared (first use in this function)
RETVAL = (int)OpenProcess((DWORD)PROCESS_ALL_ACCESS,FALSE,(DWORD)PID);
^
Suspend.xs:75:35: error: expected â)â before âPROCESS_ALL_ACCESSâ
RETVAL = (int)OpenProcess((DWORD)PROCESS_ALL_ACCESS,FALSE,(DWORD)PID);
^
Makefile:336: recipe for target 'Suspend.o' failed
make: *** [Suspend.o] Error 1
------------------------------
PREREQUISITES
------------------------------
Prerequisite modules loaded:
build_requires:
Module Need Have
------------------- ---- -------
ExtUtils::MakeMaker 0 7.04_01
configure_requires:
Module Need Have
------------------- ---- -------
ExtUtils::MakeMaker 0 7.04_01
------------------------------
ENVIRONMENT AND OTHER CONTEXT
------------------------------
Environment variables:
AUTOMATED_TESTING = 1
LANG = en_US.UTF-8
NONINTERACTIVE_TESTING = 1
PATH = /home/perltest/sysperl/bin:/home/perltest/perl5/perlbrew/bin:/home/perltest/perl5/perlbrew/perls/perl-5.22.0/bin:/home/perltest/perltest/bin:/home/perltest/perl5/perlbrew/bin:/home/perltest/perl5/perlbrew/perls/perl-5.18.4-ld/bin:/usr/local/sbin:/usr/local/bin:/usr/sbin:/usr/bin:/sbin:/bin:/usr/games:/usr/local/games:/home/perltest/perltest/bin
PERL = /data/perl5/perlbrew/perls/perl-5.22.0/bin/perl
PERL5LIB = /home/perltest/sysperl/lib/perl5:
PERL5OPT =
PERL5_CPANPLUS_IS_RUNNING = 10336
PERL5_CPAN_IS_RUNNING = 10336
PERL5_CPAN_IS_RUNNING_IN_RECURSION = 2027,10336
PERLBREW_BASHRC_VERSION = 0.73
PERLBREW_HOME = /home/perltest/.perlbrew
PERLBREW_LIB =
PERLBREW_MANPATH = /home/perltest/perl5/perlbrew/perls/perl-5.22.0/man
PERLBREW_PATH = /home/perltest/perl5/perlbrew/bin:/home/perltest/perl5/perlbrew/perls/perl-5.22.0/bin
PERLBREW_PERL = perl-5.22.0
PERLBREW_ROOT = /home/perltest/perl5/perlbrew
PERLBREW_VERSION = 0.73
PERL_CR_SMOKER_CURRENT = Win32-Process-Suspend-0.0642
PERL_EXTUTILS_AUTOINSTALL = --defaultdeps
PERL_LOCAL_LIB_ROOT = /home/perltest/sysperl:
PERL_MB_OPT = --install_base "//home/perltest/sysperl"
PERL_MM_OPT = INSTALL_BASE=/home/perltest/sysperl
PERL_MM_USE_DEFAULT = 1
SHELL = /bin/bash
TERM = screen
Perl special variables (and OS-specific diagnostics, for MSWin32):
$^X = /data/perl5/perlbrew/perls/perl-5.22.0/bin/perl
$UID/$EUID = 2000 / 2000
$GID = 2000 2000
$EGID = 2000 2000
Perl module toolchain versions installed:
Module Have
------------------- --------
CPAN 2.11
CPAN::Meta 2.150001
Cwd 3.56
ExtUtils::CBuilder 0.280221
ExtUtils::Command 1.20
ExtUtils::Install 2.04
ExtUtils::MakeMaker 7.04_01
ExtUtils::Manifest 1.70
ExtUtils::ParseXS 3.28
File::Spec 3.56
JSON 2.90
JSON::PP 2.27300
Module::Build 0.4214
Module::Signature n/a
Parse::CPAN::Meta 1.4414
Test::Harness 3.35
Test::More 1.001014
YAML 1.15
YAML::Syck n/a
version 0.9909
--
Summary of my perl5 (revision 5 version 22 subversion 0) configuration:
Platform:
osname=linux, osvers=3.19.0-18-generic, archname=x86_64-linux
uname='linux perltest.antelope.net 3.19.0-18-generic #18-ubuntu smp tue may 19 18:31:35 utc 2015 x86_64 x86_64 x86_64 gnulinux '
config_args='-de -Dprefix=/home/perltest/perl5/perlbrew/perls/perl-5.22.0 -Aeval:scriptdir=/home/perltest/perl5/perlbrew/perls/perl-5.22.0/bin'
hint=recommended, useposix=true, d_sigaction=define
useithreads=undef, usemultiplicity=undef
use64bitint=define, use64bitall=define, uselongdouble=undef
usemymalloc=n, bincompat5005=undef
Compiler:
cc='cc', ccflags ='-fwrapv -fno-strict-aliasing -pipe -fstack-protector-strong -I/usr/local/include -D_LARGEFILE_SOURCE -D_FILE_OFFSET_BITS=64',
optimize='-O2',
cppflags='-fwrapv -fno-strict-aliasing -pipe -fstack-protector-strong -I/usr/local/include'
ccversion='', gccversion='4.9.2', gccosandvers=''
intsize=4, longsize=8, ptrsize=8, doublesize=8, byteorder=12345678, doublekind=3
d_longlong=define, longlongsize=8, d_longdbl=define, longdblsize=16, longdblkind=3
ivtype='long', ivsize=8, nvtype='double', nvsize=8, Off_t='off_t', lseeksize=8
alignbytes=8, prototype=define
Linker and Libraries:
ld='cc', ldflags =' -fstack-protector-strong -L/usr/local/lib'
libpth=/usr/local/lib /usr/lib/gcc/x86_64-linux-gnu/4.9/include-fixed /usr/include/x86_64-linux-gnu /usr/lib /lib/x86_64-linux-gnu /lib/../lib /usr/lib/x86_64-linux-gnu /usr/lib/../lib /lib
libs=-lpthread -lnsl -ldb -ldl -lm -lcrypt -lutil -lc
perllibs=-lpthread -lnsl -ldl -lm -lcrypt -lutil -lc
libc=libc-2.21.so, so=so, useshrplib=false, libperl=libperl.a
gnulibc_version='2.21'
Dynamic Linking:
dlsrc=dl_dlopen.xs, dlext=so, d_dlsymun=undef, ccdlflags='-Wl,-E'
cccdlflags='-fPIC', lddlflags='-shared -O2 -L/usr/local/lib -fstack-protector-strong'
Characteristics of this binary (from libperl):
Compile-time options: HAS_TIMES PERLIO_LAYERS PERL_DONT_CREATE_GVSV
PERL_HASH_FUNC_ONE_AT_A_TIME_HARD PERL_MALLOC_WRAP
PERL_NEW_COPY_ON_WRITE PERL_PRESERVE_IVUV
USE_64_BIT_ALL USE_64_BIT_INT USE_LARGE_FILES
USE_LOCALE USE_LOCALE_COLLATE USE_LOCALE_CTYPE
USE_LOCALE_NUMERIC USE_LOCALE_TIME USE_PERLIO
USE_PERL_ATOF
Locally applied patches:
Devel::PatchPerl 1.38
Built under linux
Compiled at Jul 15 2015 23:22:15
%ENV:
PERL="/data/perl5/perlbrew/perls/perl-5.22.0/bin/perl"
PERL5LIB="/home/perltest/sysperl/lib/perl5:"
PERL5OPT=""
PERL5_CPANPLUS_IS_RUNNING="10336"
PERL5_CPAN_IS_RUNNING="10336"
PERL5_CPAN_IS_RUNNING_IN_RECURSION="2027,10336"
PERLBREW_BASHRC_VERSION="0.73"
PERLBREW_HOME="/home/perltest/.perlbrew"
PERLBREW_LIB=""
PERLBREW_MANPATH="/home/perltest/perl5/perlbrew/perls/perl-5.22.0/man"
PERLBREW_PATH="/home/perltest/perl5/perlbrew/bin:/home/perltest/perl5/perlbrew/perls/perl-5.22.0/bin"
PERLBREW_PERL="perl-5.22.0"
PERLBREW_ROOT="/home/perltest/perl5/perlbrew"
PERLBREW_VERSION="0.73"
PERL_CR_SMOKER_CURRENT="Win32-Process-Suspend-0.0642"
PERL_EXTUTILS_AUTOINSTALL="--defaultdeps"
PERL_LOCAL_LIB_ROOT="/home/perltest/sysperl:"
PERL_MB_OPT="--install_base "//home/perltest/sysperl""
PERL_MM_OPT="INSTALL_BASE=/home/perltest/sysperl"
PERL_MM_USE_DEFAULT="1"
@INC:
/home/perltest/sysperl/lib/perl5/x86_64-linux
/home/perltest/sysperl/lib/perl5
/home/perltest/perl5/perlbrew/perls/perl-5.22.0/lib/site_perl/5.22.0/x86_64-linux
/home/perltest/perl5/perlbrew/perls/perl-5.22.0/lib/site_perl/5.22.0
/home/perltest/perl5/perlbrew/perls/perl-5.22.0/lib/5.22.0/x86_64-linux
/home/perltest/perl5/perlbrew/perls/perl-5.22.0/lib/5.22.0
.