HTML-CTPP2 v2.6.7 Perl 5 v5.22.2 x86_64-linux-thread-multi

Status
Unknown
From
Slaven Rezić (SREZIC)
Dist
HTML-CTPP2 v2.6.7
Platform
Perl 5 v5.22.2 x86_64-linux-thread-multi
Date
2018-11-04T03:56:26
ID
9aa6deee-dfe5-11e8-ac76-b454bc9d9dd2
This distribution has been tested as part of the CPAN Testers
project, supporting the Perl programming language.  See
http://wiki.cpantesters.org/ for more information or email
questions to cpan-testers-discuss@perl.org


--
Dear Andrei V. Shetuhin,

This is a computer-generated report for HTML-CTPP2-2.6.7
on perl 5.22.2, created by CPAN-Reporter-1.2018.

Thank you for uploading your work to CPAN.  However, attempting to
test your distribution gave an inconclusive result.

This could be because your distribution had an error during the make/build
stage, did not define tests, tests could not be found, because your tests were
interrupted before they finished, or because the results of the tests could not
be parsed.  You may wish to consult the CPAN Testers Wiki:

http://wiki.cpantesters.org/wiki/CPANAuthorNotes

Sections of this report:

    * Tester comments
    * Program output
    * Prerequisites
    * Environment and other context

------------------------------
TESTER COMMENTS
------------------------------

Additional comments from tester:

none provided

------------------------------
PROGRAM OUTPUT
------------------------------

Output from '/usr/bin/make':

cp lib/HTML/CTPP2.pm blib/lib/HTML/CTPP2.pm
AutoSplitting blib/lib/HTML/CTPP2.pm (blib/lib/auto/HTML/CTPP2)
Running Mkbootstrap for HTML::CTPP2 ()
chmod 644 "CTPP2.bs"
"/opt/perl-5.22.2t/bin/perl" "/opt/perl-5.22.2t/lib/5.22.2/ExtUtils/xsubpp"  -C++ -typemap "/opt/perl-5.22.2t/lib/5.22.2/ExtUtils/typemap" -typemap "perlobject.map" -typemap "typemap"  CTPP2.xs > CTPP2.xsc && mv CTPP2.xsc CTPP2.c
Please specify prototyping behavior for CTPP2.xs (see perlxs manual)
g++ -c  -I/usr/include/ctpp2 -I/usr/include -I/usr/local/include -I.  -D_REENTRANT -D_GNU_SOURCE -fwrapv -fno-strict-aliasing -pipe -fstack-protector-strong -I/usr/local/include -D_LARGEFILE_SOURCE -D_FILE_OFFSET_BITS=64 -O2   -DVERSION=\"2.6.7\" -DXS_VERSION=\"2.6.7\" -fPIC "-I/opt/perl-5.22.2t/lib/5.22.2/x86_64-linux-thread-multi/CORE"  -fexceptions -O2 -Wno-deprecated  CTPP2.c
In file included from /opt/perl-5.22.2t/lib/5.22.2/x86_64-linux-thread-multi/CORE/perl.h:3736:0,
                 from CTPP2.xs:59:
CTPP2.xs: In member function ‘int CTPP2::param(SV*, CTPP::CDT*, CTPP::CDT*, const string&, int, int&)’:
/opt/perl-5.22.2t/lib/5.22.2/x86_64-linux-thread-multi/CORE/pad.h:319:35: error: ‘SV {aka struct sv}’ has no member named ‘xpadn_ourstash’
 #define PadnameOURSTASH(pn) (pn)->xpadn_ourstash
                                   ^
/opt/perl-5.22.2t/lib/5.22.2/x86_64-linux-thread-multi/CORE/pad.h:342:27: note: in expansion of macro ‘PadnameOURSTASH’
 #define SvPAD_OUR(pn)  (!!PadnameOURSTASH(pn))
                           ^
CTPP2.xs:823:14: note: in expansion of macro ‘SvPAD_OUR’
     else if (SvPAD_OUR(pParams))
              ^
/opt/perl-5.22.2t/lib/5.22.2/x86_64-linux-thread-multi/CORE/pad.h:319:35: error: ‘SV {aka struct sv}’ has no member named ‘xpadn_ourstash’
 #define PadnameOURSTASH(pn) (pn)->xpadn_ourstash
                                   ^
/opt/perl-5.22.2t/lib/5.22.2/x86_64-linux-thread-multi/CORE/pad.h:346:21: note: in expansion of macro ‘PadnameOURSTASH’
 #define SvOURSTASH  PadnameOURSTASH
                     ^
CTPP2.xs:825:24: note: in expansion of macro ‘SvOURSTASH’
      return param((SV*)SvOURSTASH(pParams), pCDT, pUplinkCDT, sKey, iPrevIsHash, iProcessed);
                        ^
CTPP2.xs: In member function ‘int CTPP2::include_dirs(AV*)’:
CTPP2.xs:1134:17: warning: format not a string literal and no format arguments [-Wformat-security]
    warn(szTMPBuf);
                 ^
CTPP2.xs: In constructor ‘Bytecode::Bytecode(char*, int, const std::vector<std::__cxx11::basic_string<char> >&)’:
CTPP2.xs:1378:39: warning: ignoring return value of ‘size_t fread(void*, size_t, size_t, FILE*)’, declared with attribute warn_unused_result [-Wunused-result]
    (void)fread(pCore, iCoreSize, 1, F);
                                       ^
Makefile:345: recipe for target 'CTPP2.o' failed
make: *** [CTPP2.o] Error 1

------------------------------
PREREQUISITES
------------------------------

Prerequisite modules loaded:

build_requires:

    Module              Need Have   
    ------------------- ---- -------
    ExtUtils::MakeMaker 0    7.04_01


------------------------------
ENVIRONMENT AND OTHER CONTEXT
------------------------------

Environment variables:

    LANG = en_US.UTF-8
    PATH = /usr/local/bin:/usr/bin:/bin:/usr/local/sbin:/usr/sbin:/sbin:/home/cpansand/bin/linux-gnu:/home/cpansand/bin/sh:/home/cpansand/bin:/usr/games:/home/cpansand/devel:/home/eserte/src/srezic-misc/scripts
    PERL = /opt/perl-5.22.2t/bin/perl
    PERL5LIB = /home/cpansand/.cpan/build/2018110403/Template-Alloy-1.020-JUhBjD/blib/arch:/home/cpansand/.cpan/build/2018110403/Template-Alloy-1.020-JUhBjD/blib/lib
    PERL5OPT = 
    PERL5_CPANPLUS_IS_RUNNING = 24905
    PERL5_CPAN_IS_RUNNING = 24905
    PERL5_CPAN_IS_RUNNING_IN_RECURSION = 3716,24905
    PERLDOC = -MPod::Perldoc::ToTextOverstrike
    PERL_BATCH = yes
    PERL_CANARY_STABILITY_NOPROMPT = 1
    PERL_CPAN_REPORTER_CONFIG = /var/tmp/cpansmoker-1023/2018110316/cpanreporter_000_config.ini
    PERL_EXTUTILS_AUTOINSTALL = --defaultdeps
    SHELL = /usr/bin/zsh
    TERM = screen
    TMPDIR = /var/tmp/cpansmoker-1023/2018110316

Perl special variables (and OS-specific diagnostics, for MSWin32):

    $^X = /opt/perl-5.22.2t/bin/perl
    $UID/$EUID = 1023 / 1023
    $GID = 1023 1023
    $EGID = 1023 1023

Perl module toolchain versions installed:

    Module              Have    
    ------------------- --------
    CPAN                2.11    
    CPAN::Meta          2.150001
    Cwd                 3.56_01 
    ExtUtils::CBuilder  0.280221
    ExtUtils::Command   1.20    
    ExtUtils::Install   2.04    
    ExtUtils::MakeMaker 7.04_01 
    ExtUtils::Manifest  1.70    
    ExtUtils::ParseXS   3.28    
    File::Spec          3.56_01 
    JSON                2.94    
    JSON::PP            2.27300 
    Module::Build       0.4224  
    Module::Signature   0.81    
    Parse::CPAN::Meta   1.4414  
    Test::Harness       3.35    
    Test::More          1.302086
    YAML                1.23    
    YAML::Syck          1.30    
    version             0.9909  


--

Summary of my perl5 (revision 5 version 22 subversion 2) configuration:
   
  Platform:
    osname=linux, osvers=4.4.0-81-generic, archname=x86_64-linux-thread-multi
    uname='linux ubuntu16 4.4.0-81-generic #104-ubuntu smp wed jun 14 08:17:06 utc 2017 x86_64 x86_64 x86_64 gnulinux '
    config_args='-ds -e -Dprefix=/opt/perl-5.22.2t -Dusethreads -Dcf_email=srezic@cpan.org'
    hint=recommended, useposix=true, d_sigaction=define
    useithreads=define, usemultiplicity=define
    use64bitint=define, use64bitall=define, uselongdouble=undef
    usemymalloc=n, bincompat5005=undef
  Compiler:
    cc='cc', ccflags ='-D_REENTRANT -D_GNU_SOURCE -fwrapv -fno-strict-aliasing -pipe -fstack-protector-strong -I/usr/local/include -D_LARGEFILE_SOURCE -D_FILE_OFFSET_BITS=64',
    optimize='-O2',
    cppflags='-D_REENTRANT -D_GNU_SOURCE -fwrapv -fno-strict-aliasing -pipe -fstack-protector-strong -I/usr/local/include'
    ccversion='', gccversion='5.4.0 20160609', gccosandvers=''
    intsize=4, longsize=8, ptrsize=8, doublesize=8, byteorder=12345678, doublekind=3
    d_longlong=define, longlongsize=8, d_longdbl=define, longdblsize=16, longdblkind=3
    ivtype='long', ivsize=8, nvtype='double', nvsize=8, Off_t='off_t', lseeksize=8
    alignbytes=8, prototype=define
  Linker and Libraries:
    ld='cc', ldflags =' -fstack-protector-strong -L/usr/local/lib'
    libpth=/usr/local/lib /usr/lib/gcc/x86_64-linux-gnu/5/include-fixed /usr/include/x86_64-linux-gnu /usr/lib /lib/x86_64-linux-gnu /lib/../lib /usr/lib/x86_64-linux-gnu /usr/lib/../lib /lib
    libs=-lpthread -lnsl -lgdbm -ldb -ldl -lm -lcrypt -lutil -lc -lgdbm_compat
    perllibs=-lpthread -lnsl -ldl -lm -lcrypt -lutil -lc
    libc=libc-2.23.so, so=so, useshrplib=false, libperl=libperl.a
    gnulibc_version='2.23'
  Dynamic Linking:
    dlsrc=dl_dlopen.xs, dlext=so, d_dlsymun=undef, ccdlflags='-Wl,-E'
    cccdlflags='-fPIC', lddlflags='-shared -O2 -L/usr/local/lib -fstack-protector-strong'


Characteristics of this binary (from libperl): 
  Compile-time options: HAS_TIMES MULTIPLICITY PERLIO_LAYERS
                        PERL_DONT_CREATE_GVSV
                        PERL_HASH_FUNC_ONE_AT_A_TIME_HARD
                        PERL_IMPLICIT_CONTEXT PERL_MALLOC_WRAP
                        PERL_NEW_COPY_ON_WRITE PERL_PRESERVE_IVUV
                        USE_64_BIT_ALL USE_64_BIT_INT USE_ITHREADS
                        USE_LARGE_FILES USE_LOCALE USE_LOCALE_COLLATE
                        USE_LOCALE_CTYPE USE_LOCALE_NUMERIC USE_LOCALE_TIME
                        USE_PERLIO USE_PERL_ATOF USE_REENTRANT_API
  Built under linux
  Compiled at Jun 27 2017 20:04:14
  %ENV:
    PERL="/opt/perl-5.22.2t/bin/perl"
    PERL5LIB="/home/cpansand/.cpan/build/2018110403/Template-Alloy-1.020-JUhBjD/blib/arch:/home/cpansand/.cpan/build/2018110403/Template-Alloy-1.020-JUhBjD/blib/lib"
    PERL5OPT=""
    PERL5_CPANPLUS_IS_RUNNING="24905"
    PERL5_CPAN_IS_RUNNING="24905"
    PERL5_CPAN_IS_RUNNING_IN_RECURSION="3716,24905"
    PERLDOC="-MPod::Perldoc::ToTextOverstrike"
    PERL_BATCH="yes"
    PERL_CANARY_STABILITY_NOPROMPT="1"
    PERL_CPAN_REPORTER_CONFIG="/var/tmp/cpansmoker-1023/2018110316/cpanreporter_000_config.ini"
    PERL_EXTUTILS_AUTOINSTALL="--defaultdeps"
  @INC:
    /home/cpansand/.cpan/build/2018110403/Template-Alloy-1.020-JUhBjD/blib/arch
    /home/cpansand/.cpan/build/2018110403/Template-Alloy-1.020-JUhBjD/blib/lib
    /opt/perl-5.22.2t/lib/site_perl/5.22.2/x86_64-linux-thread-multi
    /opt/perl-5.22.2t/lib/site_perl/5.22.2
    /opt/perl-5.22.2t/lib/5.22.2/x86_64-linux-thread-multi
    /opt/perl-5.22.2t/lib/5.22.2
    .